program: Gaussian 09
title: 000086249
version: EM64L-G09RevD.01
frameworkgroup: C1[X(C14H19ClN4O)]
method: RPBEPBE
basis: SDD
operation: Freq
keyword: #p
keyword: freq=noraman
keyword: PBEPBE/SDD
title: #p freq=noraman PBEPBE/SDD
converged: YES YES NO NO
title: Mulliken charges:
elementType: Cl O N N N N C C C C C C C C C C C C C C H H H H H H H H H H H H H H H H H H H
charge: -0.077988 -0.299963 -0.090204 -0.176152 -0.108444 -0.615927 -0.347088 -0.378630 -0.360705 -0.388374 -0.398048 -0.060406 -0.491353 0.484194 0.188791 -0.365099 -0.360719 -0.221754 -0.220847 -0.118495 0.193169 0.205109 0.218037 0.190976 0.216707 0.212683 0.219187 0.206365 0.216366 0.213806 0.229291 0.217550 0.240182 0.222564 0.238828 0.248814 0.248334 0.333463 0.335779
chargesum: 0.00000
title: Mulliken charges with hydrogens summed into heavy atoms:
elementType: Cl O N N N N C C C C C C C C C C C C C C
charge: -0.077988 -0.299963 -0.090204 -0.176152 -0.108444 0.053315 0.051190 0.030382 0.068685 0.037178 0.032124 0.168885 -0.033621 0.484194 0.188791 -0.142535 -0.121891 0.027060 0.027487 -0.118495
polarizability: 3.07223965e+02 -1.82419670e+00 1.60336004e+02 -1.41090685e+01 -3.51443705e+00 1.19397932e+02
1716.lowfreq: -9.9123 -3.3160 -0.0026 -0.0025 -0.0019 3.5055 15.7368 27.9821 32.1834
frequency: 15.4924 27.8880 32.1646 53.0766 54.9677 77.8497 97.6538 148.0119 170.5137 188.9209 215.5449 236.0762 260.8202 278.9534 312.3117 324.2885 347.3209 355.0087 372.5905 391.5460 411.6455 434.0356 435.1253 440.8284 462.9493 476.9319 509.0939 567.5340 625.2818 642.4609 644.9133 680.3410 695.3130 725.0282 731.6388 778.9271 797.7023 807.9058 824.5591 839.4565 846.0080 904.0736 916.5478 919.4281 926.2147 940.7852 941.6457 970.5092 982.9420 1007.1772 1045.8405 1056.8378 1062.5303 1080.4438 1088.9027 1096.0788 1117.3133 1118.5469 1135.9439 1145.5261 1165.2627 1196.0390 1198.6029 1212.9587 1230.2512 1243.0744 1259.2561 1273.2802 1290.6025 1300.7061 1304.7101 1321.9844 1340.0940 1342.9346 1351.8851 1358.8294 1367.9111 1374.0509 1381.6426 1395.0177 1413.0975 1454.4414 1455.2581 1461.2028 1465.6722 1473.5979 1485.5484 1490.4834 1571.4024 1588.4466 1609.5158 1698.4186 2859.8827 2866.7665 2899.9298 2913.4892 2924.6743 2996.2232 3029.0130 3038.9904 3043.7194 3055.7325 3056.4430 3069.5890 3089.1601 3147.5447 3154.0613 3169.4658 3175.8297 3583.9807 3735.4961
redmass: 6.9377 4.2954 5.3034 4.0160 3.6645 6.4642 4.8439 6.5455 4.8230 4.5949 3.2514 2.5973 2.9114 3.3082 5.7822 3.3988 2.0046 1.3555 2.6726 2.3220 2.9745 4.0990 1.5969 1.6438 3.3543 2.7901 2.7712 3.7056 6.9575 5.1270 3.7481 6.0711 3.1450 4.6659 4.7646 3.0998 1.3765 1.7853 4.5539 2.9721 1.6530 1.9597 3.8400 2.6388 1.4885 3.4665 1.3871 1.9770 4.0567 2.5424 1.8339 1.9867 2.0501 2.7196 2.0531 2.1360 2.2549 1.4728 1.6208 2.6795 2.2352 1.1624 1.3346 1.5825 1.4009 1.4658 1.4208 1.4578 1.3679 1.3309 1.3544 1.3811 1.5708 1.4082 2.3117 1.8547 2.1849 1.6151 1.7193 1.4432 3.6939 1.0830 1.0896 1.0932 1.0984 1.1023 1.0881 2.4968 7.3258 1.1826 6.2419 7.8438 1.0711 1.0698 1.0686 1.0687 1.0706 1.0639 1.0908 1.0889 1.0900 1.0911 1.0964 1.0934 1.0895 1.0872 1.0877 1.0961 1.0960 1.0445 1.1058
irintensity: 0.3083 0.5794 0.0572 1.5191 0.4620 0.5976 0.2737 0.2014 3.5779 3.9751 3.0593 0.5762 1.7766 4.7017 5.7319 7.9222 59.5336 187.4842 13.5557 18.5519 0.7354 3.0269 48.8206 44.6068 7.9526 1.9391 25.6984 4.5378 0.3895 33.5818 20.8705 1.5269 3.1663 2.6149 10.9553 15.8987 4.1443 69.7613 18.3097 30.2667 4.5123 10.9803 49.9180 63.5032 13.7399 40.5901 5.9216 17.1958 27.8625 56.5827 1.3087 4.8703 4.3091 21.9020 3.3875 10.1702 9.7850 3.2314 65.7978 54.6737 19.3329 10.4522 8.7498 4.0670 44.7543 151.8508 40.8975 31.3436 29.2194 9.2965 21.7006 29.8139 24.9896 1.9214 81.8634 26.3175 14.1095 8.1460 37.9384 0.9674 0.4808 6.0409 11.0134 43.2005 40.3465 6.6979 4.2639 257.5848 2.3946 56.7514 88.0849 506.4917 49.2047 76.8797 87.1924 61.3882 101.2896 49.6918 2.1877 34.2683 51.5634 26.6666 20.2713 54.0022 20.3862 12.2777 8.2831 14.7542 4.6354 99.5545 54.0510
temp: 298.150 k
press: 1.00000 atm
elementType: 17 8 7 7 7 7 6 6 6 6 6 6 6 6 6 6 6 6 6 6 1 1 1 1 1 1 1 1 1 1 1 1 1 1 1 1 1 1 1
symmnumber: 1
zpe: 835484.7 jmol-1
zpe.correction: 0.318219 hartree
zpe.thermalcorrener: 0.337136 hartree
zpe.thermalcorrenthalpy: 0.338080 hartree
zpe.thermalcorrgfe: 0.268402 hartree
zpe.sumelectzpe: -1297.640806 hartree
zpe.sumelectthermal: -1297.621889 hartree
zpe.sumelectthermalent: -1297.620945 hartree
zpe.sumelectthermalfe: -1297.690623 hartree
dipole: 4.1397 0.9708 -1.7665
dipole: 4.6044
quadrupole: -142.0668 -118.6740 -129.4141
quadrupole: 3.7700 -11.8028 4.1617
quadrupole: -12.0152 11.3776 0.6375 3.7700 -11.8028 4.1617
hfenergy: -1297.959025 hartree
pointgroup: C01 [X(C14H19Cl1N4O1)]
dipole: -1.6231735 -0.2359907 -0.7688723 debye
polarizability: 306.9886859|-4.8758655|157.4369857|14.9283235|11.0383859|122.5322307 unknown
InChI: InChI=1S/C14H19ClN4O/c15-11-1-3-12(4-2-11)19-7-5-18(6-8-19)10-13-9-17-14(16)20-13/h1-4,13H,5-10,16H2
charge 0 multiplicity 1
39 atoms
Cl 7.576697 0.008251 0.295913
O  -5.07072 -0.803106 -0.521541
N  -1.389106 0.060946 -0.324129
N  1.509434 0.02119 -0.249438
N  -5.370545 0.758905 1.211426
N  -7.121951 0.322738 -0.390002
C  -0.642337 -1.204813 -0.522751
C  -0.596086 1.189537 -0.865728
C  -2.773227 0.011419 -0.850878
C  0.711566 -1.143209 0.20212
C  0.767731 1.294753 -0.159132
C  -3.72405 -0.689923 0.139408
C  -4.018084 0.151822 1.425408
C  2.915973 0.018891 -0.082607
C  -5.875844 0.161338 0.163322
C  3.676514 -1.176368 -0.277773
C  3.636856 1.209444 0.242464
C  5.079467 -1.182536 -0.161045
C  5.044125 1.209997 0.349948
C  5.754246 0.014326 0.14897
H  -0.4702 -1.404269 -1.611073
H  -1.226432 -2.047494 -0.111212
H  -1.153143 2.129935 -0.701761
H  -0.421492 1.076871 -1.965872
H  -3.13429 1.047776 -0.992023
H  -2.834461 -0.498624 -1.842075
H  0.526108 -1.077829 1.298496
H  1.261683 -2.076685 0.008624
H  1.348677 2.088025 -0.660373
H  0.607086 1.595235 0.902231
H  -3.399997 -1.720612 0.358331
H  -4.03052 -0.475931 2.336221
H  -3.249286 0.932153 1.560896
H  3.180725 -2.111474 -0.5537
H  3.108344 2.14561 0.440009
H  5.639944 -2.108083 -0.323695
H  5.574136 2.133103 0.603472
H  -7.365966 -0.16579 -1.245225
H  -7.785175 0.94168 0.064874
