program: Gaussian 09
title: 000086211
version: EM64L-G09RevD.01
frameworkgroup: C1[X(C18H24ClN3O)]
method: RPBEPBE
basis: SDD
operation: Freq
keyword: #p
keyword: freq=noraman
keyword: PBEPBE/SDD
title: #p freq=noraman PBEPBE/SDD
converged: NO YES NO NO
title: Mulliken charges:
elementType: Cl O N N N C C C C C C C C C C C C C C C C C C H H H H H H H H H H H H H H H H H H H H H H H H
charge: -0.063438 -0.453121 -0.115595 -0.050360 -0.104162 0.229447 -0.069523 -0.155815 -0.519475 -0.517516 -0.104476 -0.508902 -0.623338 -0.705332 -0.732431 0.551037 -0.212913 -0.380362 -0.442060 -0.222633 -0.213085 -0.292718 -0.109393 0.250269 0.284909 0.228984 0.225643 0.241680 0.233105 0.201586 0.263598 0.255778 0.213407 0.226587 0.344461 0.212924 0.201496 0.235770 0.208664 0.214832 0.232617 0.292468 0.235309 0.238843 0.253903 0.253466 0.265865
chargesum: 0.00000
title: Mulliken charges with hydrogens summed into heavy atoms:
elementType: Cl O N N N C C C C C C C C C C C C C C C C C C
charge: -0.063438 -0.108660 -0.115595 -0.050360 -0.104162 0.229447 0.180746 0.129093 -0.064848 -0.042731 0.097111 0.010475 -0.183344 -0.055143 -0.076319 0.551037 0.079555 -0.145053 -0.203216 0.031270 0.040381 -0.026853 -0.109393
polarizability: 2.74677497e+02 1.48039442e+01 2.31530200e+02 2.33247126e+01 -6.69197486e+00 1.50280823e+02
1716.lowfreq: -11.9890 -0.0021 -0.0010 -0.0008 2.0602 4.8156 18.3231 25.5342 32.7826
frequency: 17.3718 25.4204 32.4265 35.1773 50.7390 65.8431 74.0038 86.8927 102.6843 132.7115 144.3479 159.0258 183.0951 199.8747 223.9280 235.4709 252.4996 278.4215 290.1616 306.3261 334.3978 341.8580 356.2078 362.2951 372.3192 393.5796 408.7582 418.6651 436.9016 496.6844 511.2675 537.8470 584.2294 627.5952 632.8702 645.2493 657.2989 668.2974 706.0871 737.0266 761.8666 794.0011 809.4316 813.9394 828.5910 831.1755 845.9451 856.4602 863.8717 894.0493 905.8095 915.3445 921.2605 942.1715 946.8641 955.4891 962.7346 964.5820 969.9374 999.1635 1001.7742 1014.8039 1046.0737 1066.3306 1071.9062 1073.3016 1081.6776 1107.0971 1115.0321 1131.3432 1137.7428 1166.5833 1178.2942 1182.5034 1184.2502 1185.8466 1200.5830 1214.6721 1226.6912 1238.5318 1253.0863 1258.8760 1280.7644 1286.8249 1292.1159 1293.9580 1300.3334 1307.4586 1313.1407 1316.9381 1321.4171 1338.3829 1357.6131 1361.2921 1378.0096 1383.8349 1385.8026 1396.6964 1402.6580 1421.8945 1454.2267 1461.4663 1465.9152 1470.7877 1476.7308 1478.8802 1485.7536 1488.5264 1496.1440 1586.7978 1601.1945 2939.8775 2971.6982 2979.2368 2981.6668 2988.2044 2990.1754 3004.5618 3017.6632 3042.7887 3048.9238 3051.5681 3062.0879 3069.7316 3074.5420 3079.1104 3093.4443 3110.3602 3125.1437 3128.1922 3166.5373 3169.5321 3244.8602 3255.9427 3527.3357
redmass: 6.0103 4.0829 5.4599 4.3519 3.0761 3.8467 3.9314 4.0735 2.7165 5.2749 4.7973 4.9629 1.5410 2.1089 3.5772 1.1496 4.2905 6.9442 4.1583 3.2305 1.4151 1.9741 2.5290 2.6575 2.5028 3.4458 2.8678 2.8215 2.6733 3.2920 4.1458 3.3368 3.4646 6.6857 4.9039 4.1493 4.5209 3.3889 3.6858 2.3571 3.9381 2.1879 2.0169 1.4013 1.3414 1.6810 1.3882 2.2497 2.7022 2.2889 2.0054 4.6067 1.2475 1.9550 1.4680 2.2463 2.1933 1.4182 2.3901 2.6872 2.1710 2.6296 2.6381 1.9809 2.8253 2.7152 2.2029 1.5501 2.3031 1.6010 2.3542 1.5826 1.9488 2.1068 1.1551 1.8404 1.4100 2.5528 1.3155 3.1189 1.3400 1.3330 1.3574 2.0978 1.3680 1.7149 1.3775 1.4412 1.4631 1.6609 1.6215 1.3891 1.5137 1.5619 4.9944 1.4419 1.9841 2.4772 1.2149 2.4645 1.2180 1.0492 1.1222 1.0537 1.0749 2.3171 1.0584 1.0557 1.0863 7.2698 6.3266 1.0816 1.0365 1.0429 1.0732 1.0672 1.0617 1.0760 1.0717 1.0583 1.0995 1.0992 1.0992 1.0989 1.1019 1.0990 1.0977 1.1048 1.0897 1.0897 1.0950 1.0960 1.0977 1.1011 1.0659
irintensity: 0.3013 0.3205 0.5493 0.2135 0.5620 0.5109 1.9129 1.1102 0.4922 0.9796 3.4772 1.7623 1.0020 1.9441 2.6968 0.1762 0.1516 6.0075 7.6280 3.1692 120.1911 58.7003 22.7367 15.4200 2.4757 1.5332 0.0340 1.2484 1.5497 12.0999 5.8630 21.3593 3.2734 0.4206 2.8164 8.0275 14.7480 22.1848 3.8978 4.9306 6.5233 35.1325 9.6854 17.5668 2.4588 8.9691 19.2151 6.9061 18.2302 4.6816 6.4107 10.2652 7.4889 8.4696 2.6554 12.5172 9.1539 1.3484 5.6893 41.3529 7.6026 39.0897 12.3890 2.4543 18.7666 33.5307 4.5254 5.6322 22.8467 7.2288 0.3596 3.0010 11.2025 5.4203 1.5348 11.7376 16.3392 0.1306 13.6096 28.2350 4.7396 14.1761 3.2334 1.2839 8.6204 1.0857 9.8092 4.3276 3.9604 0.8649 8.7436 5.5834 7.8486 14.9286 0.1466 26.1445 2.6522 4.4379 24.6544 30.1096 17.1346 7.2851 14.9429 4.8277 2.0491 89.6038 10.4537 15.9550 10.9316 0.9097 3.5921 22.1097 30.3581 28.1739 28.3840 28.4686 31.3580 13.2774 24.6429 15.4699 28.1712 0.6602 6.0279 69.6882 56.1767 41.7585 36.9947 4.4232 11.5990 14.3463 7.3120 0.3349 1.4656 1.8657 4.5590
temp: 298.150 k
press: 1.00000 atm
elementType: 17 8 7 7 7 6 6 6 6 6 6 6 6 6 6 6 6 6 6 6 6 6 6 1 1 1 1 1 1 1 1 1 1 1 1 1 1 1 1 1 1 1 1 1 1 1 1
symmnumber: 1
zpe: 1021457.1 jmol-1
zpe.correction: 0.389052 hartree
zpe.thermalcorrener: 0.411782 hartree
zpe.thermalcorrenthalpy: 0.412726 hartree
zpe.thermalcorrgfe: 0.334350 hartree
zpe.sumelectzpe: -1398.100342 hartree
zpe.sumelectthermal: -1398.077613 hartree
zpe.sumelectthermalent: -1398.076669 hartree
zpe.sumelectthermalfe: -1398.155045 hartree
dipole: -2.8193 -2.7913 0.5433
dipole: 4.0043
quadrupole: -158.1902 -150.5078 -150.2716
quadrupole: 5.8130 -4.0690 -0.3744
quadrupole: -5.2003 2.4821 2.7182 5.8130 -4.0690 -0.3744
hfenergy: -1398.4893944 hartree
pointgroup: C01 [X(C18H24Cl1N3O1)]
dipole: 1.2092823 -0.9922694 -0.1870583 debye
polarizability: 275.2895266|-11.4043614|228.9887276|26.7069059|9.4733139|152.2102662 unknown
InChI: InChI=1S/C18H24ClN3O/c1-13(2)17-8-5-15(9-14-3-6-16(19)7-4-14)18(17,23)10-22-12-20-11-21-22/h3-4,6-7,11-13,15,17,23H,5,8-10H2,1-2H3
charge 0 multiplicity 1
47 atoms
Cl -6.771808 -0.727473 -0.513848
O  1.823064 0.149896 1.695876
N  1.936251 2.279945 -0.334019
N  0.911079 2.839648 -1.11222
N  1.617583 4.332458 0.5228
C  1.637516 -0.158128 0.264309
C  2.1875 -1.594905 -0.015165
C  0.13288 -0.244352 -0.169557
C  1.468432 -2.00258 -1.339091
C  0.187367 -1.112194 -1.460899
C  3.728501 -1.804145 -0.059561
C  2.406576 0.909007 -0.574571
C  -0.768202 -0.874256 0.934769
C  4.435749 -1.403456 1.258599
C  4.055108 -3.283171 -0.389333
C  -2.246776 -0.844009 0.57479
C  2.33508 3.185831 0.629844
C  -2.943336 0.389837 0.476284
C  -2.968878 -2.03923 0.330444
C  -4.31496 0.436795 0.14679
C  -4.34375 -2.017184 -0.001834
C  0.767121 4.072957 -0.547101
C  -4.995486 -0.774018 -0.08905
H  1.801472 -2.215408 0.819986
H  -0.256458 0.764761 -0.402547
H  1.221166 -3.077849 -1.341197
H  2.141601 -1.833792 -2.201974
H  0.243615 -0.466316 -2.355575
H  -0.731495 -1.714224 -1.567851
H  4.141449 -1.186308 -0.887445
H  2.299645 0.707246 -1.652268
H  3.475152 0.872827 -0.307296
H  -0.605021 -0.329657 1.884953
H  -0.450914 -1.917091 1.122143
H  1.30894 0.968764 1.920061
H  4.078437 -2.035167 2.093555
H  5.529083 -1.545142 1.167144
H  4.233734 -0.358487 1.546169
H  3.632996 -3.954971 0.383326
H  5.149002 -3.442828 -0.410779
H  3.649034 -3.592396 -1.368608
H  3.134143 2.996585 1.341624
H  -2.413219 1.331668 0.663623
H  -2.45714 -3.006012 0.408089
H  -4.843996 1.391773 0.077879
H  -4.892479 -2.945428 -0.185265
H  0.042438 4.78978 -0.923602
