program: Gaussian 09
title: 000086241
version: EM64L-G09RevD.01
frameworkgroup: C1[X(C16H27N3O5)]
method: RPBEPBE
basis: SDD
operation: Freq
keyword: #p
keyword: freq=noraman
keyword: PBEPBE/SDD
title: #p freq=noraman PBEPBE/SDD
converged: YES YES NO NO
title: Mulliken charges:
elementType: O O O O O N N N C C C C C C C C C C C C C C C C H H H H H H H H H H H H H H H H H H H H H H H H H H H
charge: -0.466741 -0.456024 -0.275579 -0.304612 -0.292910 -0.324796 -0.159694 -0.398231 0.314672 -0.434843 -0.501387 -0.422910 -0.415385 -0.711726 -0.376545 -0.104048 0.213051 -0.162624 -0.381593 -0.218525 0.192386 0.356988 -0.752766 -0.630673 0.248875 0.200243 0.236973 0.226748 0.205742 0.198951 0.299678 0.227118 0.250455 0.214938 0.232373 0.225370 0.214132 0.235061 0.326098 0.216488 0.263431 0.302881 0.244643 0.330889 0.262818 0.367127 0.233682 0.245440 0.216084 0.230059 0.258220
chargesum: 0.00000
title: Mulliken charges with hydrogens summed into heavy atoms:
elementType: O O O O O N N N C C C C C C C C C C C C C C C C
charge: -0.140644 -0.088897 -0.275579 -0.304612 -0.292910 -0.074341 -0.159694 -0.067342 0.314672 0.014275 -0.037667 -0.018216 0.111411 -0.039044 0.072648 0.112439 0.213051 0.100806 0.165930 0.044294 0.192386 0.356988 -0.057560 -0.142393
polarizability: 2.24166633e+02 9.31953254e+00 2.11121933e+02 -2.53829105e-01 1.06076844e+01 1.92775192e+02
1716.lowfreq: -10.6769 -4.8431 0.0005 0.0006 0.0007 6.3925 12.7034 21.5943 27.1339
frequency: 12.3584 21.4507 27.1090 35.8300 54.4402 62.1912 62.9344 67.7532 70.7225 85.0271 94.2731 131.9299 137.8672 150.8220 166.3236 170.7018 201.1558 212.6410 218.4707 227.1656 254.1969 263.9088 274.3469 293.1467 306.4886 311.2129 316.1556 334.2499 360.0219 379.2403 395.8259 404.4180 419.0827 459.5386 468.0085 488.7907 527.9526 541.6668 563.5123 565.1785 600.6201 624.4262 634.7481 644.2451 654.2540 661.2737 684.2510 713.7188 742.1252 743.6074 765.1860 775.1359 784.5002 793.0749 807.2161 821.9560 870.8222 879.0912 893.0432 913.9375 916.1647 946.8326 975.0974 984.6305 990.4922 1010.2838 1018.8358 1025.4470 1041.2907 1052.3848 1062.1340 1067.7075 1077.2609 1080.4763 1099.0986 1103.9517 1129.3476 1139.7163 1143.1165 1160.3489 1163.7760 1167.2709 1203.3524 1241.6278 1248.0160 1254.0209 1260.0983 1262.2611 1279.6814 1299.5499 1310.3336 1316.4534 1331.8470 1335.9445 1339.6746 1357.0101 1359.8917 1373.0952 1380.8532 1388.8952 1391.1136 1396.4409 1400.3574 1413.9858 1420.6505 1441.2461 1449.0735 1451.7729 1455.5485 1469.9343 1471.1160 1473.5005 1475.3210 1482.7511 1488.4312 1507.3980 1571.4532 1582.1962 1651.4102 1664.5626 2912.8783 2945.0988 2951.8739 2971.8870 2986.3589 2987.2804 2994.9532 3007.7948 3016.6961 3025.2720 3028.9442 3043.5262 3053.4315 3069.6387 3077.6610 3086.5772 3089.8414 3097.3679 3105.1091 3118.2056 3217.9871 3238.6879 3269.9461 3341.3621 3452.4618 3543.5653 3628.2162
redmass: 5.0682 5.6305 3.3147 6.1373 4.0948 4.5118 4.1971 4.6550 4.7492 5.0584 3.3480 2.2075 4.4191 4.4685 1.0777 2.8100 1.7388 3.7306 3.0598 2.7025 3.6528 3.5594 3.4516 1.5933 2.7351 2.4751 2.4220 2.5105 3.2878 3.0809 3.6778 2.9469 3.0420 3.9992 2.8615 4.1474 3.4191 1.3439 3.6501 2.8094 3.0456 1.4326 1.4046 1.4792 1.3464 1.6864 4.5531 5.6652 3.5734 4.2186 1.2759 2.2407 2.1729 1.2921 2.4690 3.6727 3.6559 3.7195 2.5186 2.5281 2.3286 1.8517 1.8134 2.6137 1.3166 1.3987 2.0469 1.8484 2.1826 1.5081 1.7268 2.1534 2.1019 2.4321 1.6789 1.7983 2.3162 1.9339 3.9981 2.2802 3.0997 2.6757 1.4442 1.4147 1.4356 1.6452 1.2035 1.3952 1.2589 3.0369 1.4423 1.3410 1.4467 1.4938 1.5328 1.9006 1.4863 1.4486 1.3325 1.4603 1.2395 1.1665 2.3160 1.2533 1.2545 1.1049 1.1693 1.1520 1.0456 1.0661 1.0615 1.0988 1.0593 1.0997 1.0661 1.0766 4.8082 7.7620 5.1215 8.3616 1.0707 1.0674 1.0633 1.0646 1.0364 1.0365 1.0837 1.0964 1.0609 1.0620 1.0876 1.0938 1.0939 1.0966 1.0995 1.1000 1.1050 1.1008 1.0618 1.1059 1.1157 1.0916 1.1099 1.0668 1.0741 1.0657 1.0814
irintensity: 1.0183 0.9033 0.1218 2.1111 1.4366 3.2953 1.3618 1.5993 1.4388 0.3195 1.1131 0.8606 1.8502 0.3127 1.1944 1.2417 0.9060 9.7117 1.3649 5.3813 12.7111 13.4108 3.6996 86.2065 15.2535 43.2870 4.2429 13.5889 14.3288 12.9156 0.7825 11.0522 4.4768 2.9408 8.5888 12.3383 10.6649 57.5793 17.1407 8.9736 3.2894 3.9131 44.2616 38.8226 179.2691 95.7896 21.4239 0.9699 2.4136 5.5509 0.4815 2.9868 17.0110 1.7794 17.6472 11.3963 38.3058 16.1129 7.4058 15.9608 39.5009 4.2222 17.0436 2.4017 56.7861 12.1885 5.1160 28.0708 18.2427 7.2303 33.1015 24.7922 31.8711 16.8725 46.3879 9.2932 15.8415 30.2927 320.1165 5.5821 9.8776 39.5271 11.2227 7.4494 21.2559 8.2495 70.0266 14.8364 10.7158 93.2260 7.0786 0.2127 2.2227 9.2809 5.2779 14.4361 23.4642 20.0478 4.3540 12.6393 30.6181 17.8395 45.2530 12.1302 101.9941 2.0179 40.6106 20.4567 10.4988 25.0478 35.0985 2.4398 18.5443 26.6282 16.4657 3.3592 9.4109 114.6925 2.3995 497.6332 80.2980 72.3544 26.3293 45.8022 34.6131 15.1244 33.6630 24.3628 11.6825 25.4687 29.2116 41.7165 10.7141 17.6532 47.3638 24.0140 8.3166 27.0043 5.4485 31.3654 4.9604 2.1848 0.3412 255.5350 0.2526 3.5119 77.9131
temp: 298.150 k
press: 1.00000 atm
elementType: 8 8 8 8 8 7 7 7 6 6 6 6 6 6 6 6 6 6 6 6 6 6 6 6 1 1 1 1 1 1 1 1 1 1 1 1 1 1 1 1 1 1 1 1 1 1 1 1 1 1 1
symmnumber: 1
zpe: 1112314.7 jmol-1
zpe.correction: 0.423658 hartree
zpe.thermalcorrener: 0.450419 hartree
zpe.thermalcorrenthalpy: 0.451363 hartree
zpe.thermalcorrgfe: 0.364122 hartree
zpe.sumelectzpe: -1164.369047 hartree
zpe.sumelectthermal: -1164.342286 hartree
zpe.sumelectthermalent: -1164.341342 hartree
zpe.sumelectthermalfe: -1164.428583 hartree
dipole: 6.2763 3.4922 3.0806
dipole: 7.8152
quadrupole: -142.4123 -128.7190 -147.2948
quadrupole: -4.6368 -11.7073 0.4167
quadrupole: -2.9370 10.7564 -7.8194 -4.6368 -11.7073 0.4167
hfenergy: -1164.792705 hartree
pointgroup: C01 [X(C16H27N3O5)]
dipole: -2.2635946 1.8827859 -0.8861959 debye
polarizability: 220.2516468|-11.1370467|216.4675156|-4.9293324|-7.2771912|191.3445959 unknown
InChI: InChI=1S/C16H27N3O5/c1-4-16(23,5-7-19-8-6-18-15(19)22)11-17-9-13(20)10-24-14(21)12(2)3/h6,8,13,17-18,20,23H,2,4-5,7,9-11H2,1,3H3
charge 0 multiplicity 1
51 atoms
O  -3.044711 -1.099699 -1.921244
O  3.046516 -2.959839 1.60772
O  2.124499 -0.107184 0.17195
O  -0.21561 1.620946 2.34785
O  4.19705 -1.139835 -0.096204
N  -0.503822 -2.297463 0.511907
N  -1.488047 2.201515 0.38278
N  -1.227491 3.771324 1.934401
C  -2.599778 -1.407101 -0.530819
C  -2.477332 -0.088767 0.276077
C  -1.233615 -2.102555 -0.754342
C  -3.646947 -2.330897 0.158799
C  -1.431567 0.894253 -0.291267
C  -3.911178 -3.672452 -0.555519
C  0.891124 -2.779257 0.401322
C  1.770834 -2.242696 1.559785
C  -0.892392 2.431166 1.644184
C  -2.168664 3.355888 -0.054587
C  1.931613 -0.709485 1.545042
C  -2.005846 4.335099 0.902168
C  3.311658 -0.32957 -0.4993
C  3.407641 0.496779 -1.747923
C  2.25082 1.404177 -2.11169
C  4.545219 0.379988 -2.4878
H  -2.197115 -0.324291 1.318478
H  -3.472457 0.403368 0.296713
H  -0.623156 -1.452267 -1.407491
H  -1.411085 -3.038982 -1.331917
H  -3.333112 -2.513943 1.206483
H  -4.597876 -1.760263 0.234122
H  -0.41954 0.481817 -0.139688
H  -1.596518 1.048837 -1.372951
H  -1.041639 -2.842444 1.197638
H  -4.779346 -4.187468 -0.105792
H  -4.121281 -3.509952 -1.627586
H  -3.046547 -4.356216 -0.483898
H  1.304968 -2.430275 -0.562733
H  0.98708 -3.88692 0.407251
H  -3.979246 -0.769804 -1.878237
H  1.274046 -2.482738 2.521423
H  -2.695446 3.391491 -1.003745
H  1.024884 -0.190259 1.889066
H  2.801397 -0.419084 2.162764
H  -0.92585 4.22621 2.79238
H  -2.36695 5.358223 0.925042
H  3.688855 -2.468173 1.015016
H  1.324977 0.820536 -2.26868
H  2.035278 2.119126 -1.297731
H  2.471662 1.967439 -3.034073
H  4.687615 0.957224 -3.407664
H  5.346328 -0.296927 -2.172381
