program: Gaussian 09
title: 000086168
version: EM64L-G09RevD.01
frameworkgroup: C1[X(C8H8N2OS)]
method: RPBEPBE
basis: SDD
operation: Freq
keyword: #p
keyword: freq=noraman
keyword: PBEPBE/SDD
title: #p freq=noraman PBEPBE/SDD
converged: YES YES NO NO
title: Mulliken charges:
elementType: S O N N C C C C C C C C H H H H H H H H
charge: 0.229103 -0.204779 -0.325820 -0.028562 -0.334794 -0.548650 0.174711 -0.250287 -0.173392 -0.159768 -0.343491 -0.187358 0.318046 0.258474 0.255925 0.343793 0.250310 0.245310 0.236917 0.244312
chargesum: 0.00000
title: Mulliken charges with hydrogens summed into heavy atoms:
elementType: S O N N C C C C C C C C
charge: 0.229103 -0.204779 0.017973 -0.028562 -0.016747 -0.034251 0.174711 -0.250287 0.076917 0.085543 -0.099180 0.049559
polarizability: 1.81372315e+02 -7.01918216e+00 1.13631165e+02 3.26036931e+00 5.39029635e+00 6.29304697e+01
1716.lowfreq: -8.0939 -0.0014 -0.0013 0.0015 5.9538 8.9405 38.3595 57.0627 92.1375
frequency: 38.3294 56.8921 92.1326 115.6169 171.2532 250.6220 264.8707 384.6624 403.1765 423.5639 471.7747 477.9977 501.5828 590.3269 612.1675 653.0814 705.1986 733.9798 739.4149 764.6063 880.6474 885.0100 948.8309 951.7223 955.1443 982.9877 994.7753 1000.6998 1034.3742 1074.3363 1081.5679 1115.5439 1120.8511 1165.7295 1175.9481 1214.2274 1247.9678 1276.7973 1307.6978 1312.5702 1401.3801 1432.3042 1434.4213 1552.0806 1571.0869 1749.4169 3051.6491 3099.3662 3130.4970 3135.7989 3145.1601 3163.4691 3179.0035 3566.9604
redmass: 6.1051 4.9792 8.3063 4.2757 5.3739 4.8647 5.2830 8.1084 3.3620 10.0757 3.5948 3.7934 1.9125 2.6158 6.3260 1.6299 6.8043 4.8740 3.2172 1.4135 3.4533 1.3131 2.1087 4.7723 1.4286 2.6444 1.3378 3.0973 2.6431 1.4308 1.9170 2.1819 2.5725 1.0761 1.4406 1.9507 1.2361 1.5272 2.1154 5.4240 1.8710 1.3407 1.4951 5.8733 5.4440 11.3733 1.0598 1.0905 1.1064 1.0885 1.0894 1.0953 1.1013 1.0820
irintensity: 1.4525 1.8144 3.1296 2.6492 1.0410 4.1965 3.8762 4.7597 3.6000 5.5220 6.1070 4.1887 14.3817 23.8582 2.9213 163.4450 24.8993 21.3528 8.4448 77.7970 26.8891 0.5494 6.3491 8.7201 0.2570 48.1539 0.1489 27.9128 7.7787 12.7672 2.5703 8.3286 118.3568 3.5357 3.2383 27.3738 159.8758 7.3769 34.4296 36.9718 36.7517 83.4300 16.1506 20.0912 106.7769 640.1899 7.1931 10.6983 9.2716 11.8476 7.2787 13.2148 17.6117 36.4950
temp: 298.150 k
press: 1.00000 atm
elementType: 16 8 7 7 6 6 6 6 6 6 6 6 1 1 1 1 1 1 1 1
symmnumber: 1
zpe: 387537.9 jmol-1
zpe.correction: 0.147605 hartree
zpe.thermalcorrener: 0.158234 hartree
zpe.thermalcorrenthalpy: 0.159178 hartree
zpe.thermalcorrgfe: 0.109745 hartree
zpe.sumelectzpe: -891.556210 hartree
zpe.sumelectthermal: -891.545581 hartree
zpe.sumelectthermalent: -891.544637 hartree
zpe.sumelectthermalfe: -891.594070 hartree
dipole: -5.4553 -0.8201 1.7793
dipole: 5.7965
quadrupole: -80.1602 -73.6302 -79.0906
quadrupole: -9.4033 9.8833 2.5082
quadrupole: -2.5332 3.9968 -1.4636 -9.4033 9.8833 2.5082
hfenergy: -891.703815 hartree
pointgroup: C01 [X(C8H8N2O1S1)]
dipole: 2.1547658 -0.2646509 0.6983535 debye
dipolederiv: -0.9187655 -0.0441595 0.0830479 -0.1299315 -0.155521 -0.0982014 0.0412262 -0.0105949 -0.227708 -1.2381393 0.0319273 -0.4015394 0.1568761 -0.3219231 0.0630733 -0.7262775 0.0365323 -0.8138549 -1.3606805 -0.0495243 -0.2288633 0.0581347 -0.4747488 0.0440834 -0.3032101 -0.1019833 -0.517981 -0.6326208 -0.0182482 0.0658587 0.3588916 -0.3522428 -0.2306134 0.3759242 -0.1506472 -0.4091723 0.6594623 0.2485209 0.2666866 0.5416257 0.4390552 0.0645734 0.8257741 0.1263167 0.5272932 -0.031441 0.0535511 -0.0493031 -0.0354851 0.1251372 0.0021439 -0.1312326 -0.0002945 -0.3760325 2.1072331 -0.1257648 0.5505985 -0.3935369 0.1607162 -0.1036462 0.5525185 -0.0575584 1.0318308 1.3058282 -0.1671062 -0.418033 -0.3131045 0.0298675 0.1258441 -0.5642088 0.1029869 0.2196235 -0.708816 0.0678862 0.1771065 -0.0701879 -0.0115279 0.110225 0.1124285 0.0701091 -0.0519203 0.2745317 0.0384348 -0.0463902 -0.0674805 0.0675547 0.1730188 -0.1648328 0.1516776 0.0735022 0.2502788 0.123273 0.047054 -0.098987 0.1812895 0.2444578 -0.1756027 0.2046922 0.1516798 -0.1089212 -0.1311421 -0.1449343 0.0637031 -0.2234471 -0.0819888 0.0553602 -0.038802 -0.187469 -0.067801 0.0180227 -0.0706686 -0.0691427 -0.0903991 0.023382 -0.1208046 -0.0010139 0.0223078 0.1358619 0.0053449 -0.0181776 0.0419421 -0.0176095 -0.0762747 0.0185104 -0.056851 0.0601068 0.0167121 -0.061669 0.0369699 -0.0878997 0.0074056 0.0804599 0.0401847 0.0512468 0.0507417 0.2425748 0.0486617 0.0563807 0.0665103 0.3682385 -0.0027666 0.0455188 0.0094671 0.1722517 0.1169375 0.0189662 0.0327311 -0.0031672 0.0574379 -0.1053853 0.0153286 -0.1094379 0.0515322 -0.0586234 -0.0833913 -0.0310865 -0.0835416 0.0819337 -0.0477373 -0.0318201 -0.0460724 0.1151861 -0.0529997 0.0395856 0.0901745 0.0323907 0.1184046 -0.0598723 0.0873435 -0.0609365 0.0928338 0.0693881 -0.0131691 0.0023878 0.0323902 0.0103786 -0.1247757 0.0478714 -0.1188366 0.0152483 unknown
polarizability: 181.3627932|6.3169575|81.6260821|-7.1888073|24.4243505|94.9450744 unknown
InChI: InChI=1S/C8H8N2OS/c11-6-5-8(10-6)12-7-3-1-2-4-9-7/h1-4,8,10H,5H2
charge 0 multiplicity 1
20 atoms
S  -0.369249 0.862198 1.321111
O  -4.077686 -0.164017 -1.405376
N  -1.768232 -0.555047 -0.751004
N  1.194055 -0.575968 -0.433421
C  -1.461409 -0.56506 0.680202
C  -2.981648 -0.306354 0.963305
C  -3.142086 -0.304043 -0.597265
C  1.208949 0.402886 0.513011
C  2.388597 1.096214 0.892328
C  3.597279 0.752457 0.255968
C  2.379136 -0.904046 -1.031747
C  3.600749 -0.270515 -0.72564
H  -1.008708 -1.495464 1.048757
H  -3.221376 0.656296 1.441206
H  -3.507996 -1.127436 1.473497
H  -1.12519 -0.664193 -1.537515
H  2.353181 1.871793 1.663257
H  4.523774 1.270076 0.525439
H  4.520312 -0.56691 -1.238122
H  2.327948 -1.701867 -1.780992
