program: Gaussian 09
title: 000086206
version: EM64L-G09RevD.01
frameworkgroup: C1[X(C11H5Cl4N3O3)]
method: RPBEPBE
basis: SDD
operation: Freq
keyword: #p
keyword: freq=noraman
keyword: PBEPBE/SDD
title: #p freq=noraman PBEPBE/SDD
converged: YES YES NO NO
title: Mulliken charges:
elementType: Cl Cl Cl Cl O O O N N N C C C C C C C C C C C H H H H H
charge: 0.017986 0.012841 -0.013410 0.055735 -0.246057 -0.178338 -0.211985 -0.120573 0.075168 0.079811 0.031083 -0.339055 0.127164 0.637974 0.096647 -0.254818 -0.245186 -0.223985 -0.227503 -0.100412 -0.314802 0.264464 0.244039 0.252729 0.290640 0.289844
chargesum: 0.00000
title: Mulliken charges with hydrogens summed into heavy atoms:
elementType: Cl Cl Cl Cl O O O N N N C C C C C C C C C C C
charge: 0.017986 0.012841 -0.013410 0.055735 -0.246057 -0.178338 -0.211985 -0.120573 0.075168 0.079811 0.295547 0.157712 0.127164 0.637974 0.096647 -0.254818 -0.245186 0.066655 0.062341 -0.100412 -0.314802
polarizability: 2.59563261e+02 -3.99029320e+01 1.59721508e+02 4.91378615e+00 8.25372420e+00 1.55551478e+02
1716.lowfreq: -8.7841 -3.3274 0.0014 0.0025 0.0027 3.4099 5.9667 10.9792 20.2473
frequency: -7.5565 9.7799 20.1397 28.7077 60.4324 70.0430 120.8581 142.2559 145.7445 150.7159 170.4524 176.8026 187.1900 196.5481 200.7822 280.5760 290.2548 313.1074 342.9411 350.9124 395.2222 408.8073 409.7068 470.8842 505.2902 507.4526 541.8603 544.6114 617.8073 628.1607 646.7343 688.1112 697.9589 726.7664 739.1855 762.6926 775.0319 788.1750 815.9252 854.7227 862.5051 880.0685 885.5088 926.8155 1002.0593 1011.2347 1034.0266 1049.2929 1084.5078 1104.1665 1105.3411 1187.1499 1203.8977 1225.5168 1236.0254 1244.5487 1291.0325 1340.6100 1357.5071 1371.3716 1397.5883 1420.5889 1449.5859 1459.9674 1475.6138 1566.6350 1575.7269 3086.0769 3147.2647 3188.3421 3189.7174 3205.7247
redmass: 4.7030 11.3104 12.5577 15.4407 6.3532 9.4641 10.6496 13.9865 14.2212 15.4542 14.3170 19.7607 10.3414 4.8999 18.3273 11.7757 15.0755 8.8911 9.8757 30.4866 12.1845 7.8320 4.4867 8.4857 8.3841 5.0730 7.0667 5.4721 6.2666 8.9614 12.3299 12.2740 9.8092 5.2656 9.6336 11.3018 4.6476 12.2950 6.9496 1.4401 1.3632 4.7145 11.8917 4.2194 3.3025 1.7264 2.0395 3.7704 1.3270 1.4778 2.4770 1.4562 6.9798 5.0587 10.8641 1.7994 6.3219 2.2150 6.0512 4.9183 6.4992 4.0299 8.0465 1.3541 5.6771 9.6431 8.5954 1.0522 1.0935 1.0934 1.0942 1.1206
irintensity: 3.9051 0.4612 0.5096 0.4456 1.3197 2.3266 2.0159 0.3508 0.2455 0.9163 0.2747 0.0900 0.5688 0.0075 0.2243 3.8662 1.5402 0.6686 0.1003 0.0686 20.8990 3.4051 4.3451 3.9761 1.4385 0.0284 6.0174 7.8748 5.5510 15.6006 1.3604 0.0953 5.6872 14.3569 33.9430 66.8418 40.0412 18.6745 103.5485 37.8957 0.5476 109.2713 3.6138 136.2583 26.2172 47.6059 172.3384 86.9274 10.0806 10.7705 86.6724 4.5321 214.7298 12.2652 164.6352 6.3404 495.7226 154.9720 12.4539 25.3902 12.6505 659.1175 444.7359 140.6801 523.0878 71.5636 79.4393 8.5658 4.6529 3.9514 1.5196 9.1182
temp: 298.150 k
press: 1.00000 atm
elementType: 17 17 17 17 8 8 8 7 7 7 6 6 6 6 6 6 6 6 6 6 6 1 1 1 1 1
symmnumber: 1
zpe: 384894.7 jmol-1
zpe.correction: 0.146599 hartree
zpe.thermalcorrener: 0.165147 hartree
zpe.thermalcorrenthalpy: 0.166091 hartree
zpe.thermalcorrgfe: 0.095534 hartree
zpe.sumelectzpe: -2650.745381 hartree
zpe.sumelectthermal: -2650.726833 hartree
zpe.sumelectthermalent: -2650.725889 hartree
zpe.sumelectthermalfe: -2650.796446 hartree
dipole: -4.9229 1.0788 1.1285
dipole: 5.1646
quadrupole: -158.4151 -160.5670 -141.4988
quadrupole: -4.9612 2.4381 10.4256
quadrupole: -4.9215 -7.0734 11.9948 -4.9612 2.4381 10.4256
hfenergy: -2650.89198 hartree
pointgroup: C01 [X(C11H5Cl4N3O3)]
dipole: 1.9414085 -0.4119382 0.4357169 debye
dipolederiv: -0.2043498 0.0979987 -0.2215533 0.0924208 -0.0656218 0.1399682 -0.2195424 0.1653427 -0.5046837 -0.2206637 0.0408959 0.2451039 0.0313318 -0.0226531 -0.0123038 0.2462016 -0.0405144 -0.5462373 -0.7751934 0.2013095 0.0272723 0.2776315 -0.1164212 -0.000147 0.0293477 0.0018089 -0.1161199 -0.8287871 0.3859218 0.0404036 0.3824475 -0.2760585 -0.0223352 0.0511675 -0.0309359 -0.0418139 -0.3205683 -0.0864439 -0.0409016 0.0153538 -0.7537506 -0.1562977 -0.0343462 -0.1835595 -0.3621345 -0.5303412 0.6536759 0.0064063 0.309233 -1.902096 -0.028315 0.0475495 -0.1570743 -0.2961568 -2.069426 -0.3178577 0.0198147 -0.2883199 -0.4277843 -0.0041088 0.0154314 -0.0161207 -0.2400587 -0.9454692 -0.3635457 0.0026669 -0.4882883 -1.2737924 -0.0626558 -0.0304244 -0.0972799 -0.1162157 -0.9165934 0.5705809 0.0384639 0.4822296 -1.4250837 -0.0857591 0.0613012 -0.1313135 -0.1437982 -1.9146993 -0.0368048 0.025438 -0.0596064 -0.5593154 -0.0270483 0.0266453 -0.0415383 -0.1197571 0.646779 -0.8042239 -0.0135482 -0.3017695 1.2406702 -0.0434959 -0.0623608 0.204731 0.3884054 0.2271308 0.0989934 0.0102292 0.0548011 0.0378349 0.1371395 -0.0113573 -0.0367386 0.1814689 1.0689467 -0.1266322 -0.0161474 -0.1291779 2.3529449 0.0967834 -0.0181006 0.165148 0.2488457 1.1800815 0.1091462 -0.0179749 -0.3564331 0.0518136 0.057437 -0.0435848 0.0487498 -0.2919856 2.524671 0.3779279 -0.0195204 0.6634364 1.1762714 0.050535 0.0084499 0.0812704 0.2514539 0.2473385 -0.2310105 0.3197101 -0.1376563 0.0717012 -0.2175291 0.2468518 -0.2655335 0.8212846 0.2584531 -0.144353 -0.3649928 -0.0624007 0.0056011 -0.0053655 -0.2881194 0.0551561 0.8664675 -0.4495799 0.1247757 -0.1387218 0.1393238 -0.1186283 0.0690068 -0.1000077 0.0815815 -0.2263557 -0.4518221 0.0866647 0.1644103 0.1114963 -0.0910382 -0.0286546 0.127144 -0.0454902 -0.2503427 1.1949406 -0.379948 -0.0499398 -0.4608597 0.0888228 -0.0277905 -0.0517061 -0.0278793 0.2842197 2.1583586 -0.4365676 -0.0674648 -0.3795231 1.4515216 0.1145612 -0.0739347 0.1478431 0.0574826 -0.0027143 0.1009216 0.0331083 0.0014079 -0.0175669 0.06621 0.0600802 0.082221 0.0388889 -0.0784735 0.0453925 -0.046701 0.0302606 0.0913146 -0.0187342 -0.0274948 0.0160684 0.0359124 0.0253193 -0.0093895 0.05718 0.003885 0.1612025 -0.0193837 0.03231 -0.0030799 -0.0354702 0.0879934 0.0189331 0.0242733 0.0309495 0.1630572 0.00289 0.0247656 0.004363 0.0573769 0.0886688 0.0236391 -0.0170146 0.0378266 0.1570545 0.0253931 -0.0162667 0.0227742 0.0593235 unknown
polarizability: 258.4394975|-41.5637037|159.4025474|-3.9764351|-7.5928517|156.9942021 unknown
InChI: InChI=1S/C11H5Cl4N3O3/c12-4-1-5(13)8(6(14)2-4)21-11-17-9(15)16-10(18-11)20-7-3-19-7/h1-2,7H,3H2
charge 0 multiplicity 1
26 atoms
Cl 1.111426 1.741943 -2.714961
Cl 1.070857 1.030984 2.790803
Cl 5.591214 -0.289269 -0.143158
Cl -4.984663 1.888434 0.182299
O  -1.00874 -4.304622 -0.530808
O  -2.177944 -2.211472 -0.250686
O  0.000717 1.957201 0.097412
N  -1.001002 -0.174586 -0.076138
N  -3.426663 -0.282486 -0.055893
N  -2.30244 1.860985 0.133573
C  -0.872318 -2.869481 -0.375399
C  -0.425868 -3.721912 0.763243
C  -2.187382 -0.851583 -0.124286
C  1.269537 1.330632 0.031488
C  -1.136681 1.170509 0.04789
C  1.951825 1.23364 -1.20096
C  1.933386 0.921857 1.208752
C  3.26897 0.741213 -1.274453
C  3.249687 0.424542 1.174066
C  3.894129 0.345349 -0.076044
C  -3.395554 1.061364 0.074584
H  -0.19297 -2.337213 -1.04847
H  0.63973 -3.920484 0.918782
H  -1.08936 -3.822661 1.628835
H  3.785547 0.673388 -2.234389
H  3.752959 0.115328 2.092617
