program: Gaussian 09
title: 000086166
version: EM64L-G09RevD.01
frameworkgroup: C1[X(C18H17NO3)]
method: RPBEPBE
basis: SDD
operation: Freq
keyword: #p
keyword: freq=noraman
keyword: PBEPBE/SDD
title: #p freq=noraman PBEPBE/SDD
converged: YES YES NO NO
title: Mulliken charges:
elementType: O O O N C C C C C C C C C C C C C C C C C C H H H H H H H H H H H H H H H H H
charge: -0.241326 -0.185101 -0.226776 -0.401284 -0.004922 -0.540686 0.148512 0.350255 -0.528217 -0.566103 0.288094 0.123271 0.492112 -0.391737 -0.337209 -0.315968 -0.364433 -0.412120 -0.420713 -0.230462 -0.228294 -0.243807 0.250933 0.254497 0.268209 0.323981 0.249056 0.247920 0.231375 0.232060 0.257520 0.247654 0.252383 0.279063 0.233192 0.233673 0.224019 0.223941 0.227436
chargesum: 0.00000
title: Mulliken charges with hydrogens summed into heavy atoms:
elementType: O O O N C C C C C C C C C C C C C C C C C C
charge: -0.241326 -0.185101 -0.226776 -0.077302 0.246011 -0.017979 0.148512 0.350255 -0.031241 -0.102668 0.288094 0.123271 0.492112 -0.134217 -0.089555 -0.063585 -0.085371 -0.178927 -0.187041 -0.006443 -0.004354 -0.016371
polarizability: 3.25807285e+02 -6.93495189e+00 1.76705556e+02 -7.59293104e+00 3.16454485e+00 1.49520876e+02
1716.lowfreq: -12.6728 -2.7392 -0.0008 -0.0004 0.0006 1.7769 12.9387 16.8486 25.8079
frequency: 12.4275 16.5568 25.7333 33.2351 43.5801 56.4642 82.8707 91.1008 105.1687 125.9080 157.1641 191.8747 245.8780 278.8406 282.7533 321.5270 331.2067 379.1113 403.0820 413.7171 451.2548 462.1364 477.3067 489.3176 500.8831 521.5965 552.7010 568.7854 589.8241 617.5011 626.1392 629.5817 705.7885 728.8596 732.8192 742.4340 760.4925 774.5956 783.9570 827.5676 831.1256 843.1923 844.4436 854.5873 918.4577 937.1261 964.6598 972.4076 975.7444 982.3650 984.9767 989.6705 993.8536 995.6012 1003.9836 1011.0651 1026.1187 1026.4105 1068.1745 1080.6217 1096.4220 1112.0711 1120.6642 1137.5316 1171.6054 1172.3923 1176.7642 1186.4742 1216.2625 1217.7298 1221.9422 1250.4856 1271.0225 1288.8532 1305.8230 1326.3101 1333.1474 1337.2557 1346.5540 1374.4750 1381.4996 1424.8722 1427.0622 1433.6867 1439.7466 1469.1126 1483.4992 1494.9281 1561.2977 1587.2731 1592.4675 1614.2864 1620.0868 1763.0895 2969.4614 3011.7983 3016.1921 3021.6126 3053.8192 3071.2679 3112.4714 3113.8105 3130.3923 3134.5025 3142.1525 3146.2180 3150.1481 3161.2398 3164.9175 3173.2810 3559.5264
redmass: 4.6623 5.0754 4.8018 5.4709 4.9394 5.1883 3.7109 4.6658 3.1810 4.7986 5.7102 6.7564 5.2410 7.1860 5.0671 3.2593 3.2781 5.3531 2.8258 2.9636 3.6749 4.0101 1.6251 3.0662 3.6406 4.0400 4.5772 2.1107 2.0256 6.3345 7.2978 5.2091 1.8297 3.1007 4.5747 3.6282 2.0592 3.5823 1.5436 1.4030 2.9671 1.6528 3.4161 1.2508 1.5221 4.7322 1.3926 4.9755 1.3880 2.2752 1.7816 6.0459 1.3311 1.6981 2.6499 2.6355 2.3487 2.6349 3.2518 1.5719 1.4662 1.8562 1.4488 1.1605 1.0516 1.3750 1.3953 1.1157 2.3238 2.0110 2.4549 1.8876 1.1806 2.0016 1.3185 1.2546 1.2911 1.7101 1.7715 5.2439 7.9514 3.2588 1.1738 1.1239 2.1805 1.1057 2.3260 2.5323 7.8001 7.5172 6.0546 6.1904 6.8341 10.8451 1.0600 1.0604 1.0978 1.0874 1.0609 1.1028 1.0874 1.0868 1.0905 1.1071 1.0957 1.0878 1.0877 1.1015 1.0961 1.0969 1.0824
irintensity: 0.2213 0.8453 1.0057 0.0971 2.3246 2.5783 4.7156 0.3455 1.5000 0.2339 0.5160 3.6865 7.6527 5.6125 0.5373 1.7743 3.8866 2.7152 0.0011 0.0825 7.5965 5.6448 55.6252 6.6681 18.4788 24.5080 11.3873 8.3603 115.3859 0.0801 11.1808 21.3985 51.2339 2.7963 4.2572 21.1918 31.8660 15.1018 24.1869 4.5298 21.3534 52.8322 5.8112 0.2487 1.3697 169.7171 0.1358 95.3339 0.0109 3.3159 4.1012 0.0029 1.9547 0.2965 8.0868 113.9773 61.8944 71.0933 0.1674 8.3866 33.4690 65.1741 18.0904 1.2476 0.1090 289.3252 84.0286 0.5077 131.3157 18.1127 172.0003 43.0605 0.1190 212.5160 16.1790 0.6431 98.5375 50.2279 27.9992 74.3825 0.1926 4.1125 8.7814 15.1609 6.8889 13.5592 22.4699 34.9691 81.8931 189.2070 1.3552 37.4721 123.5811 566.4878 24.9390 15.4785 4.3476 28.9926 3.6122 15.9080 9.7077 9.5191 9.9187 6.8410 45.5065 3.3209 8.9684 26.8429 19.1369 4.1714 31.5909
temp: 298.150 k
press: 1.00000 atm
elementType: 8 8 8 7 6 6 6 6 6 6 6 6 6 6 6 6 6 6 6 6 6 6 1 1 1 1 1 1 1 1 1 1 1 1 1 1 1 1 1
symmnumber: 1
zpe: 804703.0 jmol-1
zpe.correction: 0.306495 hartree
zpe.thermalcorrener: 0.326190 hartree
zpe.thermalcorrenthalpy: 0.327134 hartree
zpe.thermalcorrgfe: 0.253305 hartree
zpe.sumelectzpe: -974.958324 hartree
zpe.sumelectthermal: -974.938630 hartree
zpe.sumelectthermalent: -974.937686 hartree
zpe.sumelectthermalfe: -975.011515 hartree
dipole: 0.8386 -1.3285 -2.2877
dipole: 2.7752
quadrupole: -156.8320 -132.8285 -122.6706
quadrupole: -19.5722 16.3331 2.5787
quadrupole: -19.3883 4.6152 14.7731 -19.5722 16.3331 2.5787
hfenergy: -975.2648197 hartree
pointgroup: C01 [X(C18H17N1O3)]
dipole: -0.3114284 0.0520268 -1.0452061 debye
polarizability: 325.4015375|-2.4551445|168.4173068|12.9048574|-12.9543795|158.2148726 unknown
InChI: InChI=1S/C18H17NO3/c20-16(11-6-13-4-2-1-3-5-13)14-7-9-15(10-8-14)22-18-12-17(21)19-18/h1-5,7-10,18-19H,6,11-12H2
charge 0 multiplicity 1
39 atoms
O  4.04618 0.700278 -0.674573
O  8.116736 1.221486 0.690014
O  -1.362629 -2.260669 1.273662
N  6.427062 0.533655 -0.916595
C  5.231846 -0.129547 -0.40168
C  5.835049 0.005258 1.045152
C  7.035986 0.719916 0.342532
C  2.788797 0.18145 -0.329579
C  -2.43413 -0.364763 0.175573
C  -3.780791 -0.990194 0.612181
C  0.152414 -0.680083 0.274571
C  -1.217287 -1.182369 0.621647
C  -4.96058 -0.134857 0.174348
C  1.677463 0.94342 -0.770119
C  2.591292 -1.009216 0.419636
C  0.375063 0.515499 -0.467077
C  1.279582 -1.426113 0.709402
C  -5.413365 0.941966 0.980869
C  -5.612874 -0.368538 -1.064052
C  -6.483728 1.764232 0.562625
C  -6.684075 0.450791 -1.487899
C  -7.122671 1.522336 -0.67595
H  5.050512 -1.150518 -0.784554
H  6.103312 -0.93484 1.551922
H  5.248242 0.654335 1.712721
H  6.684153 0.810034 -1.866109
H  -2.346262 0.663613 0.581865
H  -2.410847 -0.250846 -0.927607
H  -3.852967 -2.007841 0.188245
H  -3.771007 -1.114812 1.710198
H  1.861758 1.857606 -1.341938
H  3.438205 -1.59609 0.787438
H  -0.470905 1.116937 -0.814665
H  1.096798 -2.340026 1.284755
H  -4.9299 1.129322 1.948374
H  -5.284487 -1.204021 -1.695468
H  -6.823418 2.586707 1.202647
H  -7.178982 0.250745 -2.445262
H  -7.955548 2.156156 -1.000651
