program: Gaussian 09
title: 000086066
version: EM64L-G09RevD.01
frameworkgroup: C1[X(C8H14O2)]
method: RPBEPBE
basis: SDD
operation: Freq
keyword: #pfreq=noraman
keyword: PBEPBE/SDD
title: #p freq=noraman PBEPBE/SDD
converged: YES YES NO NO
title: Mulliken charges:
elementType: O O C C C C C C C C H H H H H H H H H H H H H H
charge: -0.276750 -0.270998 0.320298 -0.355204 -0.539648 -0.739704 -0.723300 0.267966 -0.222022 -0.673422 0.259943 0.259945 0.239058 0.209624 0.208370 0.263687 0.218041 0.214517 0.220440 0.226982 0.224485 0.209679 0.228850 0.229163
chargesum: 0.00000
title: Mulliken charges with hydrogens summed into heavy atoms:
elementType: O O C C C C C C C C
charge: -0.276750 -0.270998 0.320298 -0.095261 -0.040645 -0.058023 -0.070302 0.267966 0.229445 -0.005729
polarizability: 1.20786173e+02 2.85005355e-02 8.40302855e+01 9.04131196e-01 -1.52055581e-01 7.80274173e+01
1716.lowfreq: -12.2633 -6.1326 -0.0003 0.0003 0.0006 8.4358 28.5888 64.0669 102.8814
frequency: 27.7234 63.9955 102.8789 117.1320 181.5296 183.8104 211.5213 233.0240 256.4209 303.0487 321.1977 357.4131 363.9272 411.9202 436.2964 629.8380 673.1836 734.2376 788.0971 798.2573 811.1356 856.2449 907.8691 954.1897 957.5097 969.7336 1024.7023 1032.8068 1054.8318 1070.4178 1092.1443 1111.6992 1128.2295 1132.4392 1135.6925 1247.1595 1272.7348 1317.6098 1349.9196 1386.5927 1394.2806 1399.2148 1401.8745 1446.9591 1463.3026 1464.9035 1467.8303 1473.7641 1485.5631 1487.4908 1488.8394 1622.0632 2969.8912 2975.9518 2994.4774 3007.0048 3057.7510 3063.0466 3064.6427 3073.6292 3090.9944 3091.6360 3098.5329 3105.7979 3154.2781 3200.0698
redmass: 2.5762 3.0000 3.0322 3.3850 1.9673 1.2707 2.2830 1.1132 1.4325 3.3764 4.2065 2.4420 2.3491 2.8801 2.8870 4.4908 3.3327 4.8727 3.7340 1.1368 2.9589 2.8777 1.3310 1.8606 1.3326 2.0905 2.1375 1.3921 1.3633 2.5789 1.3664 2.2164 1.8008 2.0685 1.4931 1.1371 2.6398 2.2399 1.4501 1.2561 1.5795 1.2320 1.4731 1.2856 1.0404 1.0517 1.0522 1.0582 1.1186 1.0892 1.0562 9.5107 1.0357 1.0370 1.0358 1.0581 1.0991 1.0987 1.1065 1.0997 1.0984 1.0565 1.0984 1.1024 1.0906 1.1157
irintensity: 0.2033 2.7379 0.9239 0.9646 3.1814 0.8282 5.0393 0.2633 2.2016 1.3825 6.5066 2.1786 1.5824 7.0794 1.2973 3.1456 1.8867 7.4588 35.4436 3.4643 4.3776 3.7808 1.6626 5.7582 2.6523 10.6084 24.0720 16.1905 40.7605 178.5779 16.7111 31.7449 149.9753 152.0398 11.3977 0.0116 55.4804 14.5781 14.1002 28.5875 112.0955 12.6539 17.4136 30.6342 11.7541 6.4385 6.2383 3.9989 10.2269 12.2406 12.1321 151.1703 30.6088 50.0058 23.6578 20.9704 7.0232 55.2454 10.7894 32.6094 33.1662 13.8183 8.3831 46.3522 3.4503 7.6437
temp: 298.150 k
press: 1.00000 atm
elementType: 8 8 6 6 6 6 6 6 6 6 1 1 1 1 1 1 1 1 1 1 1 1 1 1
symmnumber: 1
zpe: 535645.3 jmol-1
zpe.correction: 0.204017 hartree
zpe.thermalcorrener: 0.215972 hartree
zpe.thermalcorrenthalpy: 0.216916 hartree
zpe.thermalcorrgfe: 0.165696 hartree
zpe.sumelectzpe: -462.873972 hartree
zpe.sumelectthermal: -462.862017 hartree
zpe.sumelectthermalent: -462.861073 hartree
zpe.sumelectthermalfe: -462.912293 hartree
dipole: 0.0212 -1.6736 -0.2584
dipole: 1.6936
quadrupole: -50.9511 -65.9475 -59.9972
quadrupole: -1.0771 1.3513 -0.7485
quadrupole: 8.0142 -6.9822 -1.0319 -1.0771 1.3513 -0.7485
hfenergy: -463.0779889 hartree
pointgroup: C01 [X(C8H14O2)]
dipole: 0.0316465 -0.5053046 0.4331745 debye
dipolederiv: -1.7175719 -0.2967859 0.2092577 -0.4584569 -0.4357523 0.1670067 0.2220181 0.1450635 -0.440926 -0.7217294 0.0608631 -0.0869633 -0.0893324 -0.5732497 0.2771198 0.0239826 0.3194881 -0.7018152 0.5524635 -0.0718409 0.0113101 0.2435914 0.1294557 -0.0261786 -0.1142654 -0.0044792 0.1240888 -1.0747295 0.0948651 -0.0490237 0.0402117 -0.0361797 0.0127888 0.0292658 0.0019946 -0.0343644 0.1158225 -0.0205525 0.0496022 -0.1123493 -0.1252101 -0.0404497 -0.1735066 -0.0314673 0.002239 -0.0491882 0.0868946 -0.0160329 0.0556486 0.017944 0.0518018 -0.0461321 0.0584831 -0.0587997 -0.0126944 0.0555473 -0.0467418 -0.0235233 0.0611102 0.0330002 0.03929 0.0157313 -0.0031189 2.0269324 0.1509199 -0.0205285 0.4365386 0.6026884 -0.4602186 -0.0235667 -0.5255212 0.7733155 0.9404211 0.0779898 -0.0236732 -0.0050805 0.3171851 0.057066 0.1397354 0.0734559 0.2784833 -0.0930331 -0.0663677 0.0621074 -0.0557487 0.0274497 0.0332863 0.0394018 0.0336044 0.0313577 0.0296698 -0.0167466 0.0086366 -0.0365315 0.0717829 0.070461 -0.0026297 0.0761977 -0.0276279 0.0897523 0.0319262 -0.0482137 -0.0164037 -0.0248178 0.0400897 -0.0092213 0.0860274 0.0469138 -0.0071996 -0.0437515 -0.0913107 -0.0521674 0.0653126 -0.0201594 -0.0781112 -0.0600396 -0.0511285 -0.1603008 -0.0305012 0.1222648 -0.0288029 0.0930975 -0.0063287 0.0923206 -0.0233689 0.0276805 0.0849645 -0.0776082 -0.0228882 -0.0492259 -0.1298711 -0.108363 0.0132055 -0.0599316 0.02398 0.0949197 0.0584952 -0.0953457 0.0546084 0.0209004 0.0722432 -0.0679189 0.0344555 0.0639415 -0.194625 0.0288934 0.0521645 0.0021003 0.059021 0.019712 0.0730151 0.0180801 0.0716174 0.0925912 0.0119971 0.0292528 0.0079621 0.0744044 -0.0426771 -0.0237244 0.0088786 -0.1698666 0.0589736 -0.0776643 -0.0218472 -0.0069844 -0.1521788 -0.0421241 -0.0272882 -0.0693137 0.0773613 -0.054983 -0.0218772 0.0029499 0.0663418 -0.1298847 0.0106558 -0.0457999 -0.0091641 0.0686475 -0.0584076 -0.0042733 0.0513599 0.0099435 0.0499272 -0.0602031 -0.0531444 -0.0580822 -0.1196477 -0.159427 0.0079989 -0.0684183 0.0198731 0.0956756 0.0306089 -0.0925135 0.0261485 0.0551417 0.1027236 0.0700995 0.0040163 0.0115962 -0.1400211 0.0098904 0.0342565 0.0002582 0.0877107 0.1146555 -0.0085208 -0.0119348 -0.0138088 0.0612106 -0.0790285 0.0513311 -0.0564993 -0.1251839 unknown
polarizability: 120.6923184|0.04529|80.4023587|-2.0910011|-2.957524|81.7491983 unknown
InChI: InChI=1S/C8H14O2/c1-4-10-7(9)6-5-8(6,2)3/h6H,4-5H2,1-3H3
charge 0 multiplicity 1
24 atoms
O  -1.629536 -0.341826 0.424247
O  -0.658581 1.065202 -1.165207
C  2.038129 -0.370834 -0.191236
C  0.712236 -0.005063 0.570594
C  1.898486 0.985906 0.484453
C  2.041336 -0.447489 -1.715848
C  2.904553 -1.427486 0.494768
C  -0.537479 0.316014 -0.161238
C  -2.956293 -0.098511 -0.218398
C  -3.988083 -0.871047 0.597646
H  0.549513 -0.530925 1.514857
H  1.735135 1.85796 -0.156471
H  2.44982 1.182774 1.4093
H  3.066004 -0.273283 -2.095647
H  1.719296 -1.448929 -2.059351
H  1.370716 0.303046 -2.16538
H  3.959352 -1.322195 0.176539
H  2.872446 -1.335216 1.595708
H  2.569873 -2.447135 0.226709
H  -3.147561 0.990052 -0.224176
H  -2.904248 -0.440859 -1.268088
H  -4.994229 -0.728081 0.162654
H  -3.760417 -1.950819 0.599789
H  -4.00767 -0.518158 1.642976
