program: Gaussian 09
title: 000086054
version: EM64L-G09RevD.01
frameworkgroup: C1[X(C18H15N3O)]
method: RPBEPBE
basis: SDD
operation: Freq
keyword: #p
keyword: freq=noraman
keyword: PBEPBE/SDD
title: #p freq=noraman PBEPBE/SDD
converged: YES YES NO NO
title: Mulliken charges:
elementType: O N N N C C C C C C C C C C C C C C C C C C H H H H H H H H H H H H H H H
charge: -0.264110 -0.022281 -0.153097 0.055914 0.250318 0.382948 -0.064424 0.536981 -0.298682 -0.374450 -0.328554 -0.327466 0.404274 -0.382269 -0.425633 -0.307983 -0.368525 -0.364501 -0.259688 -0.396120 -0.226789 -0.676213 0.208899 0.227052 0.220701 0.223334 0.230021 0.233597 0.262351 0.283064 0.245947 0.229096 0.237404 0.232888 0.247903 0.280141 0.247951
chargesum: 0.00000
title: Mulliken charges with hydrogens summed into heavy atoms:
elementType: O N N N C C C C C C C C C C C C C C C C C C
charge: -0.264110 -0.022281 -0.153097 0.055914 0.250318 0.382948 -0.064424 0.536981 -0.089783 -0.153748 -0.101502 -0.104133 0.404274 -0.152247 -0.192037 -0.045632 -0.085461 -0.118554 -0.030591 -0.158716 0.006099 0.099782
polarizability: 5.50632464e+02 8.05355526e+00 2.48145070e+02 1.03892057e+00 -3.48957556e+00 9.60793830e+01
1716.lowfreq: -10.1352 -4.9591 -0.0007 -0.0005 0.0002 3.3391 12.5973 27.0848 39.2966
frequency: 12.3001 26.9804 39.2118 41.2276 70.1158 118.1762 129.2509 153.5370 170.7974 178.1285 191.1268 226.1247 229.6591 274.0498 339.5653 342.6202 382.5353 400.4470 410.8168 414.7960 430.5578 443.7935 470.0050 484.9854 516.5660 520.2148 531.4149 580.8665 589.5461 631.4243 648.9626 659.0623 735.6815 738.3312 769.4442 786.0806 794.6135 805.7975 820.1126 837.1812 843.0026 851.4187 852.6814 869.8768 877.7356 887.9616 949.5301 959.2528 966.4715 974.6859 990.6183 996.7953 999.8933 1013.6943 1030.8796 1047.6331 1086.7235 1103.8548 1122.0276 1144.7672 1171.6560 1174.9404 1198.5870 1220.8034 1228.3351 1249.7744 1264.1585 1295.2897 1311.9648 1315.0062 1327.8964 1335.4666 1358.8381 1379.0854 1383.0646 1395.0800 1412.7431 1431.6719 1436.2495 1451.0713 1472.1950 1487.4094 1501.6496 1511.5055 1544.3241 1566.4130 1569.5693 1613.2655 1620.1228 1636.5446 2990.2806 3085.3682 3094.7733 3102.4333 3120.5635 3124.7474 3128.0868 3131.9115 3143.8857 3145.2808 3155.1620 3159.5633 3167.6786 3173.1147 3194.5240
redmass: 4.5411 5.5927 4.0347 4.8178 5.0089 5.2164 3.1909 5.3177 4.6529 4.8632 1.1870 2.8784 5.5543 4.4692 5.0633 4.7241 4.1112 4.2522 3.0780 6.2722 3.5040 4.6221 3.1554 4.8760 5.9236 4.4098 3.3498 3.6113 6.7126 6.8029 3.4487 5.7358 4.6035 3.7360 1.4313 5.5126 2.6634 5.5953 1.3836 2.1235 1.6496 2.2434 3.4002 2.8720 1.8024 2.3142 1.2956 1.4216 1.4006 1.2389 1.3460 1.3316 3.0583 4.0406 2.1147 4.9534 2.5557 1.3203 1.5597 1.3575 1.6014 1.2103 1.1769 1.9717 1.9633 1.9012 1.6778 1.9061 3.6537 1.7693 1.6154 2.3532 3.1817 3.0176 2.9067 3.5184 1.3165 2.8561 3.5163 2.6142 1.0805 1.0477 3.0414 3.1775 6.1240 6.7546 6.3574 5.7860 6.3556 5.4040 1.0321 1.1027 1.0898 1.0997 1.0889 1.0878 1.0891 1.0855 1.0896 1.0889 1.0947 1.0952 1.0942 1.0996 1.0943
irintensity: 3.8933 0.1066 2.4244 0.8139 0.0504 0.7949 0.2910 1.7520 3.8039 2.3435 0.3641 0.6054 9.6650 1.8800 2.3118 3.1009 3.6604 0.4967 0.8870 5.7989 8.1155 3.9011 0.3770 2.4467 1.0892 7.3058 12.8348 4.0010 19.4680 1.2721 0.4752 4.4485 2.7877 0.8663 71.4999 84.9504 17.6076 0.6671 10.0504 73.7416 41.4760 149.1533 40.4745 17.8360 6.1183 6.4302 18.2466 0.2554 2.4295 42.7429 0.5211 0.1016 7.0638 8.3599 8.6692 168.7785 0.8843 0.0173 5.8114 4.4140 35.3238 2.7737 6.7726 0.4884 19.3282 0.4466 12.9662 20.4354 46.6992 14.4100 61.4148 4.8292 203.9413 22.7944 6.5104 85.6125 43.7989 18.8502 20.4649 2.0017 47.1714 22.7158 13.6821 134.1167 19.1336 45.0215 54.8030 17.4212 1.8143 8.0814 25.6478 16.9725 13.5574 3.6197 31.2963 7.5065 18.2969 1.5452 21.8724 5.9305 23.6641 23.7136 16.8222 27.0595 0.1672
temp: 298.150 k
press: 1.00000 atm
elementType: 8 7 7 7 6 6 6 6 6 6 6 6 6 6 6 6 6 6 6 6 6 6 1 1 1 1 1 1 1 1 1 1 1 1 1 1 1
symmnumber: 1
zpe: 749446.5 jmol-1
zpe.correction: 0.285449 hartree
zpe.thermalcorrener: 0.304022 hartree
zpe.thermalcorrenthalpy: 0.304966 hartree
zpe.thermalcorrgfe: 0.235923 hartree
zpe.sumelectzpe: -932.808397 hartree
zpe.sumelectthermal: -932.789824 hartree
zpe.sumelectthermalent: -932.788880 hartree
zpe.sumelectthermalfe: -932.857924 hartree
dipole: 1.4191 -2.2035 1.1117
dipole: 2.8469
quadrupole: -151.2856 -116.5500 -133.5509
quadrupole: -33.2329 5.7222 -0.2599
quadrupole: -17.4901 17.2455 0.2446 -33.2329 5.7222 -0.2599
hfenergy: -933.0938466 hartree
pointgroup: C01 [X(C18H15N3O1)]
dipole: 0.5368551 -0.7525164 0.632509 debye
polarizability: 550.7159728|4.237684|238.5503261|6.2580032|-36.7532736|105.5906184 unknown
InChI: InChI=1S/C18H15N3O/c1-21(20-22)16-10-7-14(8-11-16)6-9-15-12-13-19-18-5-3-2-4-17(15)18/h2-13H,1H3
charge 0 multiplicity 1
37 atoms
O  7.319402 1.54951 -0.536504
N  -5.236929 -1.363731 0.106974
N  5.667909 0.160314 0.163077
N  6.05733 1.341767 -0.511305
C  -3.493432 0.423597 -0.057227
C  -2.443175 -0.578398 0.037186
C  -4.874198 -0.027245 -0.025693
C  1.452692 -0.647451 0.315679
C  -1.023255 -0.202764 -0.032234
C  -3.24658 1.831945 -0.162827
C  0.025549 -0.974433 0.40291
C  -2.851947 -1.922325 0.166252
C  4.26725 -0.103469 0.20997
C  1.962842 0.512638 -0.345284
C  2.400951 -1.524012 0.912839
C  -5.935489 0.929158 -0.127293
C  3.334411 0.78695 -0.401458
C  3.783105 -1.264801 0.867083
C  -4.301138 2.744434 -0.257163
C  -4.233937 -2.260591 0.204227
C  -5.657556 2.291779 -0.244486
C  6.665864 -0.733067 0.775332
H  -0.800807 0.779224 -0.466386
H  -0.199726 -1.932435 0.893316
H  -2.219604 2.210508 -0.153599
H  -2.1132 -2.728876 0.202656
H  1.274009 1.210279 -0.833284
H  2.045656 -2.425362 1.426857
H  -6.959065 0.543034 -0.103939
H  3.701945 1.677771 -0.913874
H  4.473732 -1.966949 1.342136
H  -4.088702 3.8163 -0.336283
H  -4.535722 -3.310326 0.303809
H  -6.474154 3.017866 -0.320655
H  6.501476 -0.815526 1.863754
H  7.654204 -0.282653 0.586153
H  6.625291 -1.73656 0.317284
