program: Gaussian 09
title: 000086045
version: EM64L-G09RevD.01
frameworkgroup: C1[X(C15H29BrO2)]
method: RPBEPBE
basis: SDD
operation: Freq
keyword: #p
keyword: freq=noraman
keyword: PBEPBE/SDD
title: #p freq=noraman PBEPBE/SDD
converged: YES YES NO NO
title: Mulliken charges:
elementType: Br O O C C C C C C C C C C C C C C C H H H H H H H H H H H H H H H H H H H H H H H H H H H H H
charge: -0.011896 -0.252138 -0.214714 -0.386100 -0.386724 -0.384861 -0.387636 -0.381990 -0.382906 -0.372783 -0.349519 -0.353354 -0.370143 -0.356630 -0.572409 -0.696682 0.306289 -0.501300 0.193324 0.194883 0.195729 0.193401 0.193673 0.192697 0.193865 0.198856 0.191611 0.192376 0.192976 0.201632 0.189076 0.189605 0.218996 0.192283 0.187423 0.187810 0.215846 0.263563 0.194838 0.194574 0.321642 0.209543 0.214931 0.209751 0.237771 0.248546 0.244273
chargesum: 0.00000
title: Mulliken charges with hydrogens summed into heavy atoms:
elementType: Br O O C C C C C C C C C C C C C C C
charge: -0.011896 -0.252138 -0.214714 0.002107 0.002405 0.001509 0.005085 0.001997 0.011702 0.005898 0.061761 0.021880 0.109267 0.032783 -0.250767 -0.062458 0.306289 0.229289
polarizability: 2.42912173e+02 5.03806923e+00 1.74489921e+02 3.51276099e+00 9.23992916e-02 1.46902697e+02
1716.lowfreq: -29.6569 -1.5160 -0.0013 -0.0006 0.0008 4.9788 5.7598 11.8972 21.7005
frequency: -25.6250 10.7702 21.6271 26.7970 38.6519 45.9785 55.3929 62.1300 80.9347 85.7141 95.0728 97.8274 106.7257 122.1237 126.9580 140.7312 147.0493 150.1722 168.8134 202.9644 224.1450 226.4285 244.5381 262.0175 306.1173 332.8581 385.2614 412.6339 461.7518 486.9545 500.3503 535.7013 675.6450 703.8421 717.0650 718.8458 723.5021 734.3936 755.0135 784.8356 828.6377 843.4270 878.6637 887.5337 929.5652 947.5129 978.8753 981.9603 987.2564 1012.5741 1022.8246 1030.9905 1042.2731 1060.0359 1072.5351 1076.3025 1081.3429 1082.2405 1086.1705 1112.1913 1114.3755 1121.8558 1125.5251 1150.2429 1178.4581 1190.2392 1200.6531 1209.6952 1227.7306 1232.1785 1251.5686 1253.7514 1272.2611 1274.1125 1276.6158 1281.9611 1286.9897 1289.4201 1294.4859 1295.4894 1297.5848 1318.9764 1337.6512 1350.3545 1353.5221 1356.2289 1358.1378 1366.6397 1387.7645 1421.3696 1441.5856 1452.7888 1459.1735 1459.3032 1461.9133 1462.4039 1462.8343 1465.1465 1468.5299 1473.4832 1476.1916 1478.5661 1483.2753 1486.9881 1488.9417 1639.9568 2948.3316 2948.4789 2950.2790 2950.8299 2952.2830 2954.8435 2958.2258 2959.3060 2963.4213 2967.7038 2968.5343 2971.1229 2981.2756 2984.1360 2988.4620 2994.5308 3002.3620 3006.7587 3012.0087 3022.0020 3030.8677 3037.8245 3042.9571 3057.8425 3067.5385 3069.7465 3095.6629 3109.8189 3155.0873
redmass: 1.7015 4.0687 4.4326 3.7815 3.4043 2.0887 3.6432 3.4297 1.3731 1.6916 2.8671 2.8403 3.5435 1.8308 2.4431 3.7910 2.2624 1.9894 3.8569 5.0550 3.1871 1.1611 3.3592 4.8790 3.7608 3.6265 4.0182 3.1846 3.8465 3.0767 3.5207 3.4057 5.1415 4.0280 1.0584 1.0678 1.0989 1.1536 1.1996 1.2303 1.3035 5.3848 1.2804 1.8852 1.2985 5.4427 1.4518 3.7872 3.6473 2.8641 1.3429 2.9295 2.3685 1.8706 2.3056 2.5559 2.0672 2.2356 2.5123 1.5552 1.3979 2.7702 2.8991 1.4605 1.9007 1.5746 1.2912 1.4807 1.3220 1.4088 1.3391 1.3212 1.2377 1.3119 1.0337 1.0502 1.1495 1.0729 1.1351 1.1077 1.3223 1.3861 1.4426 1.5379 1.7006 1.6518 1.6288 1.6516 1.2171 1.1852 1.0780 1.0498 1.0741 1.0738 1.0508 1.0700 1.0682 1.0712 1.0826 1.0841 1.0428 1.0864 1.0909 1.0944 1.0952 9.4434 1.0586 1.0586 1.0590 1.0591 1.0595 1.0599 1.0656 1.0600 1.0593 1.0599 1.0615 1.0365 1.0960 1.0968 1.0981 1.0998 1.1016 1.0295 1.1029 1.1032 1.1024 1.1018 1.1031 1.0974 1.1007 1.0993 1.0875 1.1047 1.1049
irintensity: 0.0860 0.1048 0.0156 0.5142 1.5921 0.2441 0.0308 0.2884 0.3751 0.0559 0.4130 0.1998 0.1016 0.0137 0.1093 0.8340 0.0793 0.0214 0.1949 5.9956 4.1655 0.1885 0.3766 4.8199 9.7740 5.1253 2.9174 1.3879 10.9135 0.7503 10.3508 7.4465 10.6536 6.3499 18.9087 0.2837 6.8994 0.3092 5.1170 1.3936 6.5340 7.6113 1.6342 5.4245 5.5951 14.3635 6.8474 1.2904 5.0414 9.2529 1.5625 2.0295 6.6082 2.1826 12.7556 2.9512 1.0192 4.6392 11.7759 12.0155 5.4344 60.4381 133.3386 20.6985 1.7918 5.0058 38.7710 16.4487 11.3946 13.3089 26.6712 6.1430 5.6158 16.4343 0.7221 1.2904 1.2222 0.8056 1.3260 0.9574 11.7932 8.5935 2.8654 2.8380 0.1219 0.1996 0.1719 2.9623 11.1487 16.8622 5.7698 16.3701 0.0153 0.0343 11.5771 0.0653 0.1659 0.2310 0.6672 1.2627 12.2405 1.4114 2.2755 3.8250 40.6378 169.0559 0.0016 0.0885 0.0260 0.1820 0.0383 1.9715 7.2686 2.1514 58.4386 39.8427 259.5252 38.3774 0.3867 0.7701 0.9851 1.1138 1.1551 29.0477 0.7578 3.7845 2.6180 11.8792 266.3757 52.7633 99.7119 55.6685 7.5815 23.1734 14.4795
temp: 298.150 k
press: 1.00000 atm
elementType: 35 8 8 6 6 6 6 6 6 6 6 6 6 6 6 6 6 6 1 1 1 1 1 1 1 1 1 1 1 1 1 1 1 1 1 1 1 1 1 1 1 1 1 1 1 1 1
symmnumber: 1
zpe: 1081486.4 jmol-1
zpe.correction: 0.411916 hartree
zpe.thermalcorrener: 0.435449 hartree
zpe.thermalcorrenthalpy: 0.436393 hartree
zpe.thermalcorrgfe: 0.352857 hartree
zpe.sumelectzpe: -751.418963 hartree
zpe.sumelectthermal: -751.395430 hartree
zpe.sumelectthermalent: -751.394486 hartree
zpe.sumelectthermalfe: -751.478023 hartree
dipole: 0.1049 -1.6360 -1.7913
dipole: 2.4282
quadrupole: -113.4670 -123.8761 -126.2157
quadrupole: 9.9531 10.3900 5.2639
quadrupole: 7.7193 -2.6898 -5.0295 9.9531 10.3900 5.2639
hfenergy: -751.8308791 hartree
pointgroup: C01 [X(C15H29Br1O2)]
dipole: -0.0282268 -0.7420136 0.6010507 debye
polarizability: 243.0870432|-3.7535351|173.6698933|3.599094|3.9951413|147.5478548 unknown
InChI: InChI=1S/C15H29BrO2/c1-3-4-5-6-7-8-9-10-11-12-13-14(16)15(17)18-2/h14H,3-13H2,1-2H3
charge 0 multiplicity 1
47 atoms
Br 5.386444 2.140606 0.154697
O  7.335526 -0.672739 0.812863
O  6.484553 -0.93326 -1.3443
C  -2.632875 0.253803 0.290919
C  -1.333958 -0.337649 -0.301456
C  -3.916209 -0.328296 -0.343387
C  -0.051475 0.240791 0.33764
C  -5.215246 0.264364 0.247685
C  1.24665 -0.346712 -0.259819
C  -6.498952 -0.319957 -0.384185
C  2.525203 0.229652 0.389423
C  -7.79826 0.272255 0.206877
C  3.810432 -0.35241 -0.233396
C  -9.081883 -0.313575 -0.424882
C  5.108968 0.116016 0.425522
C  -10.375148 0.283308 0.171346
C  6.351377 -0.539847 -0.16452
C  8.62098 -1.255382 0.351918
H  -2.651505 0.072916 1.386212
H  -2.626772 1.356099 0.158787
H  -1.313614 -0.152681 -1.395899
H  -1.342185 -1.440484 -0.173197
H  -3.897421 -0.148698 -1.438859
H  -3.92301 -1.430556 -0.21004
H  -0.070469 0.052124 1.431549
H  -0.04514 1.343708 0.212804
H  -5.233154 0.086789 1.343546
H  -5.209671 1.366349 0.112439
H  1.236167 -1.450866 -0.14355
H  1.269369 -0.148655 -1.351526
H  -6.504497 -1.422039 -0.248938
H  -6.481344 -0.142324 -1.480069
H  2.529977 1.331348 0.279707
H  2.511103 0.019936 1.47952
H  -7.817256 0.095339 1.302858
H  -7.79492 1.374224 0.070972
H  3.791686 -1.460184 -0.135763
H  3.856959 -0.141363 -1.317158
H  -9.061724 -0.136321 -1.519765
H  -9.084181 -1.414535 -0.288991
H  5.105793 0.018633 1.522069
H  -10.433702 0.093439 1.259881
H  -11.277317 -0.152152 -0.296655
H  -10.411621 1.378957 0.020859
H  9.249516 -1.293372 1.251909
H  9.069322 -0.609706 -0.421583
H  8.454785 -2.262793 -0.064964
