program: Gaussian 09
title: 000085983
version: EM64L-G09RevD.01
frameworkgroup: C1[X(C12H10O4)]
method: RPBEPBE
basis: SDD
operation: Freq
keyword: #pfreq=noraman
keyword: PBEPBE/SDD
title: #p freq=noraman PBEPBE/SDD
converged: NO YES NO YES
title: Mulliken charges:
elementType: O O O O C C C C C C C C C C C C H H H H H H H H H H
charge: -0.430397 -0.430396 -0.250359 -0.250360 0.499400 0.499400 -0.376535 -0.376536 -0.401398 -0.401398 -0.257629 -0.257628 -0.310081 -0.310082 0.153764 0.153764 0.234283 0.234283 0.242245 0.242245 0.265494 0.265494 0.250970 0.250970 0.380244 0.380244
chargesum: 0.00000
title: Mulliken charges with hydrogens summed into heavy atoms:
elementType: O O O O C C C C C C C C C C C C
charge: -0.050153 -0.050152 -0.250359 -0.250360 0.499400 0.499400 -0.142252 -0.142253 -0.159153 -0.159153 0.007865 0.007866 -0.059111 -0.059112 0.153764 0.153764
polarizability: 3.94954673e+02 -4.70335718e-05 1.42263066e+02 -1.95195696e-03 1.86543117e-04 5.61959723e+01
1716.lowfreq: -9.7902 -5.4001 -3.1183 -0.0006 0.0002 0.0011 32.0713 34.6173 53.7981
frequency: 31.9890 34.6016 53.7981 56.8003 100.5345 108.0016 149.7203 162.2052 174.5574 242.0038 256.9820 266.9353 366.4234 368.5356 413.7372 488.4208 503.2455 517.3319 521.8627 580.6327 584.0660 594.4139 634.4352 635.8823 678.2398 691.6274 756.1372 806.3904 839.3292 841.1185 845.4973 887.1966 896.6624 937.3866 939.7682 969.8359 981.8397 1007.7972 1009.4894 1014.1964 1048.6049 1051.8107 1121.3162 1194.7490 1210.9872 1229.7158 1240.0838 1241.2452 1298.7506 1300.6153 1333.6916 1336.9410 1341.6879 1388.5198 1429.5823 1507.3591 1558.2539 1607.8387 1623.9403 1634.1325 1645.0915 1651.2470 3101.9019 3102.3545 3126.8376 3137.3383 3148.4355 3159.6683 3167.2785 3167.8580 3526.0768 3526.2071
redmass: 6.7457 7.8270 7.6047 5.8642 6.3588 6.2709 3.3654 2.6866 10.7082 2.8378 7.0177 6.7830 6.0804 3.1216 2.7371 4.5754 2.1818 4.0864 6.3273 5.0235 1.2891 1.2666 5.5403 6.9945 3.1442 3.6361 3.9309 4.8859 1.3043 1.6088 5.9486 1.9619 1.8454 5.1306 4.6798 1.3402 1.3915 2.9093 1.1906 1.2306 2.1477 2.1612 1.5044 1.1738 1.3636 1.2840 1.6494 2.0936 1.6093 1.8560 1.4415 2.6082 1.8311 3.7265 3.6048 2.6081 6.0140 6.1180 8.3063 7.8466 5.7144 5.8701 1.0901 1.0902 1.0878 1.0870 1.0971 1.0969 1.0918 1.0920 1.0641 1.0641
irintensity: 0.2853 0.0000 0.3728 1.8674 0.0000 0.6485 2.9721 0.0000 0.0034 0.0291 2.1364 7.7572 13.9389 0.0000 0.0000 21.2785 0.0079 5.4847 11.2772 100.1933 0.0000 308.2178 0.0535 0.7056 0.0000 57.7744 0.0000 52.6870 0.7528 82.9115 4.9816 0.0000 4.8845 8.0894 1.3143 0.0000 0.0000 1.8367 98.1783 0.0001 918.7060 351.4546 2.6064 0.8791 52.8055 2.8787 22.5091 0.6208 0.3327 4.3176 9.1777 53.5195 209.0026 16.9280 6.1623 27.4979 31.3252 21.8267 994.3531 94.0914 163.6608 56.7896 2.9520 1.8895 8.2771 6.3086 17.9355 2.3515 10.9179 6.7260 120.6312 16.1387
temp: 298.150 k
press: 1.00000 atm
elementType: 8 8 8 8 6 6 6 6 6 6 6 6 6 6 6 6 1 1 1 1 1 1 1 1 1 1
symmnumber: 1
zpe: 503088.0 jmol-1
zpe.correction: 0.191616 hartree
zpe.thermalcorrener: 0.206485 hartree
zpe.thermalcorrenthalpy: 0.207429 hartree
zpe.thermalcorrgfe: 0.147371 hartree
zpe.sumelectzpe: -763.036538 hartree
zpe.sumelectthermal: -763.021669 hartree
zpe.sumelectthermalent: -763.020725 hartree
zpe.sumelectthermalfe: -763.080784 hartree
dipole: 0.0000 -1.6957 0.0001
dipole: 1.6957
quadrupole: -100.4133 -88.9767 -96.4117
quadrupole: -0.0001 -0.0027 0.0006
quadrupole: -5.1461 6.2906 -1.1445 -0.0001 -0.0027 0.0006
hfenergy: -763.2281543 hartree
pointgroup: C01 [X(C12H10O4)]
dipole: -0.0000269 0.6671267 -0.0002718 debye
dipolederiv: -1.0519742 0.5813779 -0.0079763 0.8532849 -0.9794677 0.010737 -0.0080857 0.0073997 -0.436594 -1.0518496 -0.581393 -0.0074977 -0.8533002 -0.9796114 -0.0102916 -0.0073682 -0.0069409 -0.4365791 -1.2394193 -0.185766 -0.0107794 -0.462769 -0.8141346 -0.0051689 -0.0104615 -0.0018035 -0.3330004 -1.2394746 0.1857171 -0.0109425 0.462721 -0.8140685 0.0055793 -0.0108314 0.0021922 -0.3330072 -0.3427535 -0.0386793 -0.0046169 -0.0796732 0.02591 -0.0009489 -0.0045753 -0.0004536 0.0362066 -0.342762 0.0386413 -0.0046487 0.0796394 0.0259212 0.0009601 -0.0046859 0.00046 0.0362053 -0.0888106 -0.1174069 0.0005126 -0.0711948 0.0115878 -0.0009131 0.0003757 -0.0014808 -0.127062 -0.0888258 0.1173988 0.0004449 0.0711836 0.0116085 0.0008362 0.0003672 0.0013988 -0.1270636 -0.0051365 0.1820171 0.0017246 0.0738255 0.0641999 0.000872 0.0018263 0.0021887 -0.1483554 -0.0051171 -0.1820218 0.00185 -0.0738333 0.0641722 -0.0010174 0.0018306 -0.0023305 -0.1483537 0.9898429 -0.0581025 0.0130365 -0.2052291 0.159067 -0.0027257 0.0132783 -0.0010083 -0.0774734 0.9898174 0.0581906 0.0129929 0.2053166 0.159093 0.002533 0.0131465 0.000822 -0.0774755 -1.5477477 0.2010986 -0.0167874 0.4367993 -0.025142 0.0051709 -0.0168797 0.0023497 -0.1786953 -1.5476894 -0.2012509 -0.0166212 -0.4369493 -0.0252052 -0.0053067 -0.0165579 -0.002481 -0.1786897 2.874824 -0.3791062 0.0320937 -0.0860828 1.3699032 -0.0019957 0.0315842 -0.005501 0.2410528 2.8747816 0.3792715 0.031795 0.0862476 1.3699474 0.0010546 0.0314964 0.0045695 0.2410472 0.0261898 0.0873982 -0.0014673 0.0705064 -0.0289167 0.000916 -0.0014426 0.0011427 0.1441677 0.0262041 -0.0873949 -0.0014145 -0.0705018 -0.0289329 -0.0008071 -0.0013967 -0.001034 0.1441688 0.0191108 -0.1011821 -0.0016279 -0.083212 -0.026629 -0.0009719 -0.0016339 -0.0011915 0.1544401 0.0190933 0.1011849 -0.0016986 0.0832151 -0.0266096 0.0010927 -0.0016932 0.0013144 0.1544384 0.0633085 -0.0217284 -0.0010306 -0.0692986 -0.018771 -0.0006733 -0.0010744 -0.0000696 0.1507704 0.0633012 0.0217345 -0.0010522 0.0693042 -0.0187611 0.0008081 -0.00111 0.0002019 0.1507698 0.0571707 -0.0644654 -0.001336 -0.1063632 -0.0162378 -0.0011296 -0.0012522 -0.0006613 0.173611 0.0571551 0.0644713 -0.0013917 0.1063684 -0.0162212 0.001288 -0.0013452 0.0008161 0.1736092 0.2453936 -0.108411 -0.0017361 -0.201357 0.2786334 -0.0023079 -0.0016742 -0.00119 0.4009321 0.2453673 0.1084068 -0.0018251 0.2013523 0.2786651 0.0024096 -0.0018369 0.0012902 0.4009298 unknown
polarizability: 394.9043208|0.0131115|142.2630542|4.1297034|-0.0319806|56.2463357 unknown
InChI: InChI=1S/C12H10O4/c13-11(14)7-5-9-1-2-10(4-3-9)6-8-12(15)16/h1-8,13,15H
charge 0 multiplicity 1
26 atoms
O  -5.925169 1.563999 -0.073184
O  5.925011 1.564591 0.071862
O  -5.822857 -0.764345 -0.069993
O  5.822903 -0.763764 0.070592
C  -1.436454 -0.424611 -0.017529
C  1.436474 -0.42446 0.017813
C  -0.700094 0.800735 -0.008834
C  0.699996 0.800808 0.008309
C  -0.702445 -1.645513 -0.008079
C  0.702582 -1.64544 0.009183
C  -2.900306 -0.483192 -0.035378
C  2.90033 -0.482897 0.03572
C  -3.76991 0.574845 -0.046667
C  3.769839 0.575227 0.046157
C  -5.225309 0.341631 -0.063796
C  5.225258 0.342156 0.063501
H  -1.234081 1.756787 -0.015678
H  1.233896 1.756913 0.014549
H  -1.247993 -2.59645 -0.014526
H  1.24822 -2.596321 0.016273
H  -3.351916 -1.486272 -0.039741
H  3.352031 -1.485932 0.040897
H  -3.447337 1.620005 -0.043581
H  3.447172 1.620356 0.042201
H  -6.902099 1.374676 -0.084635
H  6.901958 1.375367 0.083463
