program: Gaussian 09
title: 000086126
version: EM64L-G09RevD.01
frameworkgroup: C1[X(C17H32O4)]
method: RPBEPBE
basis: SDD
operation: Freq
keyword: #pfreq=noraman
keyword: PBEPBE/SDD
title: #p freq=noraman PBEPBE/SDD
converged: YES YES NO NO
title: Mulliken charges:
elementType: O O O O C C C C C C C C C C C C C C C C C H H H H H H H H H H H H H H H H H H H H H H H H H H H H H H H H
charge: -0.270992 -0.268655 -0.250327 -0.251708 0.014789 -0.034902 -0.352145 -0.409872 -0.392414 -0.356782 -0.333783 -0.384933 -0.714089 -0.725952 -0.711120 -0.389948 -0.516635 -0.494948 -0.706362 0.265226 0.264712 0.208486 0.190392 0.192279 0.185887 0.210902 0.208470 0.194610 0.207502 0.217185 0.238866 0.212302 0.253238 0.236449 0.188151 0.229800 0.212844 0.208101 0.212938 0.212707 0.254052 0.212733 0.217004 0.224228 0.246858 0.226515 0.264237 0.242801 0.223647 0.239806 0.197932 0.215923 0.233993
chargesum: 0.00000
title: Mulliken charges with hydrogens summed into heavy atoms:
elementType: O O O O C C C C C C C C C C C C C C C C C
charge: -0.270992 -0.268655 -0.250327 -0.251708 0.223275 0.155490 0.026022 0.009500 0.009698 0.099268 0.131757 0.039667 -0.063344 -0.046255 -0.057156 0.083425 -0.009597 -0.031494 -0.058514 0.265226 0.264712
polarizability: 2.13000887e+02 -7.49733256e+00 1.92849317e+02 -4.66794547e+00 1.54332076e+00 1.79913116e+02
1716.lowfreq: -23.6924 -12.1127 -4.3810 -2.6621 0.0007 0.0009 0.0009 11.2768 19.2084
frequency: -20.7959 9.8904 19.1601 24.4123 31.4674 47.9484 52.2196 57.4572 77.2309 86.5064 92.5660 103.1631 116.6607 123.7693 143.3414 164.9637 183.4687 199.5562 211.1487 216.0624 223.0298 228.9352 241.0559 245.4555 276.2211 286.7646 303.6476 318.3470 337.0482 368.8978 388.8338 401.5836 441.1225 450.2498 483.1569 516.7796 552.8613 575.2084 594.5199 668.8794 684.3806 740.8680 741.8853 762.9179 771.4341 787.6424 810.7723 811.7331 832.0613 858.2950 865.2404 890.0736 908.5324 913.8697 938.1577 942.4976 964.0337 967.0911 989.5748 993.0492 1000.8954 1010.5116 1027.4096 1032.7218 1046.2995 1058.4089 1070.6604 1086.7593 1109.9774 1110.5780 1132.1108 1141.1615 1144.5636 1152.0795 1167.9976 1168.9233 1188.5632 1220.8624 1226.5299 1232.2521 1247.7704 1250.0628 1267.3696 1270.1177 1272.5049 1283.0094 1292.8540 1311.3794 1314.4983 1321.4040 1327.7734 1330.7183 1352.1982 1355.2426 1355.6498 1360.3117 1363.8126 1369.6143 1387.4065 1388.2189 1389.9496 1396.0856 1444.7767 1452.0572 1458.8352 1464.9202 1467.0475 1469.2583 1473.2452 1474.6976 1476.1311 1477.8294 1479.3942 1480.5909 1482.2904 1486.4119 1491.2614 1492.5145 1496.3997 1634.4393 1635.8337 2949.6107 2959.8003 2962.1479 2967.4619 2969.0882 2969.4775 2977.2996 2978.0393 2979.5448 2987.0851 2989.1661 3005.0728 3010.9917 3017.6525 3020.4389 3021.4937 3022.3745 3026.4807 3031.3413 3061.2669 3063.9135 3069.1611 3070.4051 3070.8788 3071.8941 3077.0560 3080.4420 3082.6004 3082.7873 3090.8650 3091.4380 3094.1739
redmass: 3.3889 3.7922 4.5384 4.3083 5.0973 5.1917 4.2557 3.5920 2.5682 2.6750 2.1270 2.2811 2.5820 2.3925 2.5317 2.0310 2.2034 1.8392 2.1104 1.1640 1.7362 1.9872 1.4126 3.8389 2.1729 3.4077 2.2796 2.6198 2.4173 3.4152 2.6746 2.9075 2.3124 2.9819 2.7099 2.1446 3.0192 3.4411 3.7379 5.6936 2.3691 1.4482 1.4108 1.3529 2.4942 2.2403 2.1293 1.4705 4.4874 1.4942 2.0841 1.9930 1.8481 2.4193 2.8579 1.8112 1.6225 2.0413 1.8675 2.1356 1.5111 1.3913 1.7593 2.5092 2.4410 2.4312 2.6764 2.3013 1.5433 2.1437 1.9945 2.1941 2.1120 1.9826 2.4812 2.0970 1.5821 1.4086 1.5927 1.2245 1.1394 1.2879 1.2349 1.2479 1.1167 1.1891 1.1365 1.3157 1.3213 1.4779 1.5578 1.4702 1.5140 1.3580 1.5503 1.3174 1.4029 1.4739 1.2194 1.2148 1.2100 1.2121 1.0844 1.0953 1.0806 1.0740 1.0679 1.0618 1.0828 1.0576 1.0478 1.0664 1.0671 1.0590 1.0589 1.0496 1.0744 1.0549 1.0645 9.3395 9.0157 1.0805 1.0600 1.0773 1.0381 1.0622 1.0595 1.0372 1.0362 1.0365 1.0644 1.0659 1.0966 1.0602 1.0952 1.0621 1.0597 1.0588 1.0980 1.1015 1.0965 1.1006 1.0988 1.0993 1.0993 1.0995 1.1001 1.1004 1.0999 1.0998 1.1077 1.1075 1.1041
irintensity: 0.2821 0.1133 1.0510 1.0373 1.0528 0.6485 0.2141 0.1315 0.2104 3.1891 0.8674 0.4908 0.9300 0.9944 0.4845 0.2350 1.5532 1.0960 0.6054 0.3767 1.9189 0.6461 0.3847 6.7088 1.5783 3.2294 1.9918 11.3721 3.7006 5.2185 5.0863 3.7671 1.1524 1.8181 2.4470 4.3678 8.0232 4.7823 2.8593 4.6638 2.4648 0.5515 14.4300 9.9119 6.7535 11.0817 1.2314 10.7326 5.8928 3.8094 1.8628 7.7184 13.6304 17.6365 56.3909 3.0420 12.1052 2.5524 46.6727 61.3083 8.6423 1.5320 11.5773 45.6461 5.9889 10.0567 14.8017 6.7872 4.2340 137.1484 39.9564 122.6569 22.5106 10.2435 0.3831 7.2746 48.5940 42.6210 75.9474 13.1487 8.9875 5.1909 3.9886 12.8860 2.3682 0.4724 0.5078 40.0836 9.9486 2.5376 2.4120 1.4212 0.0762 9.2464 2.7987 3.5401 5.2655 16.3960 16.9677 14.8192 7.8206 22.7367 11.2508 16.2417 6.6738 1.0662 8.0880 4.0805 7.6521 23.7820 11.3563 27.7126 29.9349 10.7540 1.2656 2.0707 14.8460 15.9441 3.2548 170.0076 153.3398 12.6925 3.7013 11.8267 41.1215 107.8002 19.6515 26.8762 32.5969 33.3971 31.3486 5.1683 13.2645 15.1735 31.3941 37.2953 16.7834 48.6698 33.2682 29.2679 5.3251 57.8767 52.0196 34.3924 72.7435 42.7022 40.4360 40.2955 36.0042 29.8557 14.8330 15.0014 24.1118
temp: 298.150 k
press: 1.00000 atm
elementType: 8 8 8 8 6 6 6 6 6 6 6 6 6 6 6 6 6 6 6 6 6 1 1 1 1 1 1 1 1 1 1 1 1 1 1 1 1 1 1 1 1 1 1 1 1 1 1 1 1 1 1 1 1
symmnumber: 1
zpe: 1218781.2 jmol-1
zpe.correction: 0.464209 hartree
zpe.thermalcorrener: 0.489881 hartree
zpe.thermalcorrenthalpy: 0.490825 hartree
zpe.thermalcorrgfe: 0.404807 hartree
zpe.sumelectzpe: -966.201271 hartree
zpe.sumelectthermal: -966.175599 hartree
zpe.sumelectthermalent: -966.174655 hartree
zpe.sumelectthermalfe: -966.260673 hartree
dipole: 0.6049 -1.9362 0.6065
dipole: 2.1173
quadrupole: -124.8381 -128.6956 -137.9151
quadrupole: -0.9249 -10.1076 -2.6371
quadrupole: 5.6448 1.7873 -7.4322 -0.9249 -10.1076 -2.6371
hfenergy: -966.6654802 hartree
pointgroup: C01 [X(C17H32O4)]
dipole: 0.2657441 0.774346 -0.1537758 debye
polarizability: 212.875375|6.330013|192.0663673|6.7587079|2.861226|180.8215769 unknown
InChI: InChI=1S/C17H32O4/c1-5-9-14(4)12-20-16(18)10-8-11-17(19)21-13-15(6-2)7-3/h14-15H,5-13H2,1-4H3
charge 0 multiplicity 1
53 atoms
O  1.6451 -1.352568 0.936505
O  -3.449985 0.095749 -0.875825
O  1.514922 -2.68908 -0.979609
O  -3.619926 -0.871466 1.248542
C  3.489047 0.262227 0.490344
C  -2.693124 2.454016 -0.610136
C  -1.377801 2.106597 0.137251
C  2.875232 0.770799 -0.844483
C  5.035889 0.408391 0.56861
C  3.126252 -1.207323 0.784899
C  -3.825601 1.442863 -0.341398
C  -1.479573 2.081341 1.680806
C  -2.447956 2.628147 -2.127938
C  3.40817 0.091724 -2.127354
C  5.536694 1.858645 0.394408
C  -1.381853 -2.190575 -0.990527
C  -0.528387 -2.144123 0.297472
C  -2.906325 -2.23026 -0.692613
C  -0.106763 1.854483 2.353172
C  0.958732 -2.114761 -0.01374
C  -3.370815 -0.972279 0.0238
H  3.052928 0.876618 1.307223
H  -3.068823 3.419916 -0.204086
H  -1.001252 1.128008 -0.226853
H  -0.611998 2.854462 -0.155209
H  1.775787 0.642502 -0.792421
H  3.045155 1.862949 -0.911219
H  5.377374 0.026636 1.552833
H  5.511272 -0.239532 -0.195048
H  3.542976 -1.526893 1.755887
H  3.467058 -1.889879 -0.013841
H  -4.739303 1.723788 -0.894172
H  -4.054601 1.339061 0.732998
H  -2.177655 1.284678 2.003087
H  -1.909717 3.042077 2.032673
H  -2.112023 1.677307 -2.579101
H  -1.671656 3.392306 -2.3151
H  -3.369561 2.943104 -2.652638
H  2.923726 0.528002 -3.020199
H  4.498992 0.231303 -2.242755
H  3.192772 -0.991676 -2.133283
H  5.065548 2.533923 1.133571
H  6.631638 1.916237 0.534262
H  5.307814 2.249198 -0.613334
H  -1.103361 -3.083745 -1.577416
H  -1.160835 -1.310651 -1.622528
H  -0.781916 -1.278657 0.932358
H  -0.730185 -3.047022 0.908857
H  -3.149827 -3.09415 -0.050235
H  -3.455269 -2.326069 -1.645666
H  0.603159 2.661638 2.087108
H  -0.19831 1.833546 3.454687
H  0.340261 0.894369 2.032876
