program: Gaussian 09
title: 000086007
version: EM64L-G09RevD.01
frameworkgroup: C1[X(C11H14N2O6)]
method: RPBEPBE
basis: SDD
operation: Freq
keyword: #p
keyword: freq=noraman
keyword: PBEPBE/SDD
title: #p freq=noraman PBEPBE/SDD
converged: YES YES NO NO
title: Mulliken charges:
elementType: O O O O O O N N C C C C C C C C C C C H H H H H H H H H H H H H H
charge: -0.272929 -0.272920 -0.412893 -0.412896 -0.218029 -0.218035 -0.132944 -0.132939 -0.148520 -0.148529 -0.395019 -0.471341 -0.471353 -0.530107 -0.530110 0.213732 0.213703 0.173074 0.173080 0.332545 0.332564 0.269260 0.269258 0.248110 0.256775 0.248104 0.256779 0.254700 0.252074 0.254690 0.252085 0.384016 0.384015
chargesum: 0.00000
title: Mulliken charges with hydrogens summed into heavy atoms:
elementType: O O O O O O N N C C C C C C C C C C C
charge: -0.272929 -0.272920 -0.028877 -0.028881 -0.218029 -0.218035 -0.132944 -0.132939 0.184025 0.184034 0.143499 0.033544 0.033531 -0.023333 -0.023335 0.213732 0.213703 0.173074 0.173080
polarizability: 1.64640937e+02 -1.49009193e+01 1.32388806e+02 -2.70986550e-03 1.03336726e-05 1.27283671e+02
1716.lowfreq: -3.2545 -2.7198 -0.0005 -0.0002 0.0004 8.5887 22.0015 37.6467 38.3270
frequency: 21.8788 37.6347 38.2683 41.5550 46.7031 69.7419 75.6754 109.3764 116.9666 140.7210 161.4202 189.6091 239.9922 277.9222 312.5059 325.9934 332.7885 377.9303 428.2013 479.3865 488.5959 521.7396 525.5199 569.3691 573.5419 580.4417 593.5375 641.0579 650.2357 657.5617 676.1392 690.1100 742.0635 763.7596 767.4433 822.1778 826.8479 870.8065 878.4893 924.6202 949.4087 955.7265 1014.4182 1031.9400 1033.0193 1041.3948 1044.7172 1060.7613 1062.3884 1079.1040 1144.3133 1149.3847 1179.9874 1191.4920 1193.8630 1222.3073 1228.7141 1257.0067 1264.3222 1266.1109 1278.0312 1278.4386 1292.9196 1312.5472 1336.9969 1342.1680 1350.1400 1353.9653 1390.7524 1411.5682 1442.6493 1455.1783 1456.7858 1483.0812 1483.6559 1632.4843 1633.4762 1660.9983 1662.0444 3011.0227 3011.1240 3016.0126 3016.0381 3039.3412 3039.4940 3054.3987 3095.4842 3095.5543 3114.9563 3115.1259 3119.2269 3517.9480 3518.0096
redmass: 6.9056 13.2734 11.2589 6.5447 5.1304 6.6241 4.5020 7.6818 5.2709 2.7811 2.7115 7.9608 3.0650 3.5166 2.5713 4.2111 7.0728 7.5191 5.7019 3.4884 4.6111 2.7703 2.6803 3.8959 2.4365 3.4121 1.8146 1.9519 2.7498 4.8357 3.6453 4.0378 4.3639 2.2195 2.4894 4.2921 4.9849 1.9239 2.1332 2.8508 2.6707 2.4459 3.1718 2.4044 2.3686 3.3093 2.6654 2.0768 2.2339 2.9918 1.2665 1.2119 1.7373 1.5627 1.5366 2.0375 1.5485 2.1068 1.4421 1.6147 1.6139 1.6018 1.5597 1.7368 1.9148 1.6614 1.5211 1.7177 1.9310 1.6189 1.2160 1.0958 1.1372 1.0869 1.0876 9.5411 10.8096 9.1362 9.2215 1.0838 1.0837 1.0653 1.0654 1.0652 1.0653 1.0592 1.0974 1.0973 1.1032 1.1032 1.1066 1.0642 1.0643
irintensity: 2.5371 0.0284 0.3651 6.8169 1.0033 0.0363 10.7620 4.0794 2.2395 2.0953 5.2502 0.0013 0.0446 0.9598 16.1867 5.5715 2.5647 29.7223 0.0264 9.1923 12.5591 6.9097 51.9412 15.6433 36.7340 89.4030 5.7715 130.5210 0.0006 42.2775 5.6949 62.5659 9.8159 18.8527 4.7231 0.0527 4.1656 11.4484 3.2422 71.8299 4.7279 40.0200 0.0163 327.0904 2.6412 6.4190 20.0557 205.8873 1.8194 15.0207 0.7812 6.8836 0.0876 2.8620 3.4067 248.7444 68.7725 58.2690 4.5780 26.3698 33.7223 4.3190 2.4543 21.2735 137.2469 0.0038 19.8174 3.1772 23.8168 33.5407 37.1909 12.7081 6.1865 5.4727 14.7680 8.0510 476.7197 224.1318 272.9693 28.5902 8.9679 23.5534 0.4574 18.5450 21.0669 8.8143 2.6772 13.9735 19.6021 8.4750 1.8928 48.8034 11.7299
temp: 298.150 k
press: 1.00000 atm
elementType: 8 8 8 8 8 8 7 7 6 6 6 6 6 6 6 6 6 6 6 1 1 1 1 1 1 1 1 1 1 1 1 1 1
symmnumber: 1
zpe: 663809.8 jmol-1
zpe.correction: 0.252832 hartree
zpe.thermalcorrener: 0.271009 hartree
zpe.thermalcorrenthalpy: 0.271954 hartree
zpe.thermalcorrgfe: 0.203391 hartree
zpe.sumelectzpe: -987.032267 hartree
zpe.sumelectthermal: -987.014089 hartree
zpe.sumelectthermalent: -987.013145 hartree
zpe.sumelectthermalfe: -987.081708 hartree
dipole: -0.0007 -0.0004 -2.0408
dipole: 2.0408
quadrupole: -79.1415 -124.3061 -110.4880
quadrupole: -0.1014 0.0009 -0.0008
quadrupole: 25.5037 -19.6609 -5.8428 -0.1014 0.0009 -0.0008
hfenergy: -987.2850988 hartree
pointgroup: C01 [X(C11H14N2O6)]
dipole: -0.0003727 0.0002267 -0.8029073 debye
polarizability: 160.0534007|-18.6801908|136.9763376|-0.0148623|0.0068948|127.2836766 unknown
InChI: InChI=1S/C11H14N2O6/c14-8-3-1-6(10(16)17)12(8)5-13-7(11(18)19)2-4-9(13)15/h6-7,16,18H,1-5H2
charge 0 multiplicity 1
33 atoms
O  -0.542644 -2.442472 -0.692195
O  0.543087 2.443707 -0.689588
O  -4.148592 1.803926 0.724434
O  4.148826 -1.804543 0.721697
O  -2.922363 0.375695 2.089369
O  2.92278 -0.377886 2.088447
N  -1.189289 -0.271492 -0.071565
N  1.189506 0.271916 -0.071535
C  -2.267281 0.702044 -0.295055
C  2.267359 -0.701489 -0.296254
C  0.000182 -0.000167 0.743064
C  -3.074268 0.076207 -1.484708
C  3.074235 -0.074463 -1.485356
C  -2.731247 -1.434727 -1.430905
C  2.731392 1.436448 -1.429833
C  -1.374314 -1.489282 -0.716576
C  1.374483 1.490315 -0.715407
C  -3.109971 0.898942 0.971715
C  3.110224 -0.899864 0.970172
H  -1.844024 1.688581 -0.56362
H  1.843951 -1.687693 -0.56581
H  0.20976 -0.872824 1.381334
H  -0.209271 0.871833 1.382277
H  -2.707797 0.517306 -2.427017
H  -4.149798 0.292678 -1.402883
H  2.707584 -0.514487 -2.428098
H  4.149752 -0.29114 -1.403911
H  -2.659001 -1.905961 -2.423667
H  -3.464322 -2.01403 -0.838765
H  2.659144 1.908813 -2.422056
H  3.464571 2.014997 -0.837081
H  -4.663939 1.958223 1.56193
H  4.664286 -1.959812 1.558944
