program: Gaussian 09
title: 000086028
version: EM64L-G09RevD.01
frameworkgroup: C1[X(C16H28O2)]
method: RPBEPBE
basis: SDD
operation: Freq
keyword: #pfreq=noraman
keyword: PBEPBE/SDD
title: #p freq=noraman PBEPBE/SDD
converged: NO YES NO NO
title: Mulliken charges:
elementType: O O C C C C C C C C C C C C C C C C H H H H H H H H H H H H H H H H H H H H H H H H H H H H
charge: -0.289896 -0.216229 0.307172 -0.173175 0.241908 -0.559737 -0.409727 0.301947 -0.785343 -0.776519 -0.744731 -0.727783 0.156154 -0.815760 -0.254771 -0.376009 -0.342750 -0.687182 0.193045 0.226791 0.221404 0.242462 0.216743 0.203214 0.243059 0.199523 0.268749 0.230843 0.217736 0.219131 0.215669 0.202776 0.252790 0.232993 0.245567 0.246436 0.254628 0.186965 0.191789 0.208251 0.206820 0.192413 0.191257 0.212788 0.212391 0.216197
chargesum: 0.00000
title: Mulliken charges with hydrogens summed into heavy atoms:
elementType: O O C C C C C C C C C C C C C C C C
charge: -0.289896 -0.216229 0.307172 0.019870 0.241908 -0.111542 -0.167264 0.301947 -0.122327 -0.077404 -0.092195 -0.039225 0.156154 -0.069128 0.123984 0.039062 0.040919 -0.045806
polarizability: 2.21230333e+02 9.04492894e+00 1.68301593e+02 -1.79746076e+00 1.45057008e+00 1.50803900e+02
1716.lowfreq: -9.1718 -6.4369 -0.0002 0.0007 0.0009 8.5891 27.0367 44.1254 47.7676
frequency: 26.8290 44.0382 47.6010 62.7306 75.2980 99.9522 109.5943 118.2900 139.6987 141.4754 162.6550 179.5878 192.8474 212.6511 230.8516 237.7525 251.1142 256.0594 271.3725 283.5614 291.1202 308.4848 318.5922 335.3200 342.1471 386.7059 404.7125 430.2732 456.6190 464.9270 483.0130 499.2937 514.1668 577.3616 593.9615 639.4603 743.5585 774.6210 789.9325 810.9929 847.2756 851.1947 885.3864 897.2222 905.8855 917.1571 925.3078 936.7276 937.4090 943.7278 951.4737 969.4322 976.8428 991.9177 1004.3572 1021.5315 1036.5743 1039.1229 1083.5618 1096.8599 1103.8261 1125.5602 1140.1331 1143.1181 1159.9309 1181.1956 1204.1901 1211.4304 1214.0264 1239.2872 1258.9680 1272.4688 1277.4947 1284.7483 1289.5124 1316.8819 1336.9122 1346.3861 1348.0554 1363.0570 1374.1849 1377.1594 1377.9284 1393.0252 1393.8114 1398.7607 1441.8318 1449.7980 1450.1428 1459.8539 1462.0904 1469.2438 1471.7102 1472.6022 1473.7197 1478.8966 1480.5724 1482.2719 1483.4538 1489.3462 1491.0912 1507.5837 1620.1669 1690.6116 2937.6623 2948.9301 2960.7871 2963.4764 2965.4169 2967.3778 2975.6370 2977.4211 2981.5127 2989.6520 2994.3220 2995.1564 3005.6160 3009.3599 3053.7822 3058.5215 3060.5946 3064.5359 3069.9807 3071.2476 3071.5791 3074.4628 3075.3665 3076.4850 3102.8039 3113.8990 3117.8330 3123.1959
redmass: 4.0463 3.7966 1.6553 3.9572 3.1652 2.5770 1.9840 2.5373 2.6434 1.0970 2.9088 3.6219 1.7106 2.4275 3.1816 1.1405 1.9953 1.3473 1.1378 2.2838 1.5349 2.3719 2.2897 2.0068 2.8026 3.2135 2.6547 2.4587 3.3646 2.6181 3.3392 3.1694 3.1225 4.0632 2.5199 3.9897 1.0730 4.0066 3.3665 1.1361 3.3637 1.5546 2.5120 2.2694 2.1786 2.5817 1.6548 1.4012 1.4784 1.4677 1.9134 1.6758 2.3526 1.9392 1.3539 1.4024 1.9972 3.1821 2.1868 2.4240 2.5276 2.5453 1.9251 1.4243 1.8393 2.6025 3.0942 1.4938 2.4586 2.6566 1.8853 1.2986 1.2142 1.0877 1.4204 1.4994 1.9517 1.4642 1.4679 1.2540 1.1896 1.2463 1.3658 1.2230 1.2045 1.1953 1.0736 1.0869 1.0535 1.0496 1.0528 1.0728 1.0547 1.0625 1.0597 1.0418 1.0536 1.0675 1.0563 1.0564 1.0898 1.0508 6.7216 8.3450 1.0561 1.0604 1.0710 1.0442 1.0587 1.0365 1.0362 1.0373 1.0384 1.0393 1.0602 1.1038 1.0976 1.1009 1.0985 1.1041 1.0965 1.0974 1.0996 1.0990 1.0972 1.1013 1.0995 1.0975 1.1004 1.0899 1.1009 1.0969
irintensity: 0.0724 0.6068 0.7285 4.4713 1.1015 0.7521 0.8876 1.2506 1.1444 0.8077 3.2244 0.1058 1.4477 2.8096 2.1242 0.2152 0.6944 0.1027 0.1459 0.8067 0.0368 1.5307 0.3812 0.3820 0.2905 0.5784 0.1652 2.1693 1.4800 0.6713 0.4732 3.6928 5.3584 15.9969 1.9176 2.1415 8.5735 0.7706 1.3294 0.2904 2.9427 24.2084 3.5016 4.9878 13.5191 0.9856 1.8034 1.4191 3.4089 1.5233 2.8694 7.8236 12.2878 63.7668 0.5044 0.5666 0.9630 7.9381 14.4830 162.4948 62.2618 9.1356 4.0167 4.4134 54.5354 81.5255 58.1146 4.0516 6.7046 7.4511 19.5692 1.8698 4.8673 0.1313 3.8822 5.9228 75.8682 0.3710 28.4412 66.2169 5.5397 43.6172 23.6523 6.5633 27.6311 19.6347 14.6938 4.9354 11.0819 1.0746 1.8674 2.9992 12.7212 3.3596 4.1228 12.9607 4.8835 10.8379 13.2833 4.7912 14.0707 13.6021 80.5865 69.1525 20.6263 52.7579 10.1917 45.3449 43.1979 42.5862 36.5813 8.3703 23.6687 30.4329 37.9699 25.8609 28.3777 5.0275 36.1284 19.6690 15.6930 20.1133 19.0160 20.0145 57.7842 99.3639 55.3607 40.3455 9.4869 18.8383 15.9166 18.1926
temp: 298.150 k
press: 1.00000 atm
elementType: 8 8 6 6 6 6 6 6 6 6 6 6 6 6 6 6 6 6 1 1 1 1 1 1 1 1 1 1 1 1 1 1 1 1 1 1 1 1 1 1 1 1 1 1 1 1
symmnumber: 1
zpe: 1060739.8 jmol-1
zpe.correction: 0.404014 hartree
zpe.thermalcorrener: 0.425906 hartree
zpe.thermalcorrenthalpy: 0.426851 hartree
zpe.thermalcorrgfe: 0.353683 hartree
zpe.sumelectzpe: -775.467661 hartree
zpe.sumelectthermal: -775.445769 hartree
zpe.sumelectthermalent: -775.444825 hartree
zpe.sumelectthermalfe: -775.517992 hartree
dipole: -2.1002 -1.0906 -3.2746
dipole: 4.0402
quadrupole: -118.3275 -109.9877 -112.9573
quadrupole: 4.7556 -6.7278 0.0815
quadrupole: -4.5700 3.7698 0.8002 4.7556 -6.7278 0.0815
hfenergy: -775.8716758 hartree
pointgroup: C01 [X(C16H28O2)]
dipole: -0.8253413 0.1762334 1.3469891 debye
polarizability: 220.5282097|-11.0896801|167.6269661|0.2571554|4.8917622|152.180651 unknown
InChI: InChI=1S/C16H28O2/c1-7-8-9-18-13-10-15(3,4)14(12(2)17)16(5,6)11-13/h10,14H,7-9,11H2,1-6H3
charge 0 multiplicity 1
46 atoms
O  -2.167233 -0.421379 -0.584532
O  4.189242 0.371417 -0.466505
C  1.240493 1.222551 0.032617
C  1.96756 -0.110472 0.476382
C  1.522613 -1.413067 -0.310618
C  -0.285026 1.01657 0.283314
C  0.014488 -1.369454 -0.528949
C  -0.787869 -0.309179 -0.256267
C  1.726733 2.389007 0.936528
C  1.47044 1.616412 -1.450477
C  1.835006 -2.656394 0.583339
C  2.242557 -1.639231 -1.674709
C  3.495609 0.050568 0.539134
C  4.156018 -0.170825 1.896784
C  -3.128937 0.18478 0.36212
C  -4.533292 -0.118325 -0.16605
C  -5.639812 0.479891 0.733892
C  -7.058641 0.160812 0.215805
H  1.628572 -0.279071 1.521303
H  -0.832241 1.844668 -0.211336
H  -0.499159 1.100724 1.369988
H  -0.44815 -2.27773 -0.9377
H  1.114029 3.29232 0.755678
H  1.640942 2.135057 2.011459
H  2.778072 2.652702 0.721095
H  1.115117 2.65175 -1.61468
H  2.541148 1.568261 -1.708906
H  0.909931 0.958273 -2.135848
H  1.341912 -2.578176 1.569913
H  1.467665 -3.577841 0.094935
H  2.924504 -2.776119 0.73671
H  1.822176 -2.544216 -2.152848
H  2.10949 -0.795689 -2.367039
H  3.326936 -1.794068 -1.539682
H  3.812692 0.606423 2.607568
H  3.856721 -1.145475 2.324762
H  5.25236 -0.119132 1.804934
H  -2.968251 1.281138 0.430799
H  -2.982378 -0.255376 1.371963
H  -4.658848 -1.215504 -0.241258
H  -4.622045 0.284463 -1.193576
H  -5.509418 1.579545 0.800282
H  -5.528014 0.08904 1.766212
H  -7.208772 0.564753 -0.802933
H  -7.22696 -0.931463 0.170937
H  -7.834975 0.596662 0.870857
