program: Gaussian 09
title: 000085971
version: EM64L-G09RevD.01
frameworkgroup: C1[X(C9H13N3S)]
method: RPBEPBE
basis: SDD
operation: Freq
keyword: #p
keyword: freq=noraman
keyword: PBEPBE/SDD
title: #p freq=noraman PBEPBE/SDD
converged: YES YES NO NO
title: Mulliken charges:
elementType: S N N N C C C C C C C C C H H H H H H H H H H H H H
charge: 0.122489 -0.033709 -0.590702 -0.550089 -0.613978 -0.329886 0.311113 -0.335543 -0.393262 -0.264595 -0.213496 -0.203779 -0.258621 0.250937 0.269667 0.226105 0.232909 0.244055 0.244703 0.222031 0.222505 0.224287 0.271846 0.286074 0.322521 0.336418
chargesum: 0.00000
title: Mulliken charges with hydrogens summed into heavy atoms:
elementType: S N N N C C C C C C C C C
charge: 0.122489 -0.033709 -0.032782 0.108851 -0.093374 0.129128 0.311113 -0.091488 -0.148559 -0.264595 0.008535 0.018726 -0.034334
polarizability: 1.81235517e+02 2.65930622e+01 1.22590148e+02 6.23802635e+00 -8.02167536e-01 1.23685151e+02
1716.lowfreq: -10.8443 -7.8339 -0.0019 0.0017 0.0023 1.0674 10.2531 38.1489 54.4358
frequency: -0.5328 37.9251 54.3878 74.0347 89.9379 108.5552 131.5998 183.3841 210.6390 238.7358 330.5966 346.5767 367.7641 410.0780 431.2525 454.1746 488.2563 519.4329 528.3293 538.8664 608.8409 614.2438 619.6145 668.6901 694.2492 756.4615 762.5912 782.3406 832.6760 900.9084 926.2982 962.7039 982.5074 984.3822 1018.9909 1024.3011 1061.2464 1076.8953 1079.0656 1104.4234 1167.3905 1179.9051 1203.7281 1222.8767 1266.4389 1296.0274 1308.1285 1309.8671 1365.8498 1372.2095 1434.2998 1436.8792 1473.5313 1476.6555 1576.5899 1579.2260 1604.9906 1637.4302 1689.1623 2938.9368 3029.1367 3056.1964 3113.1333 3122.0044 3130.4902 3148.8698 3157.2581 3167.6875 3501.7917 3520.1982 3632.9041 3686.9696
redmass: 4.9909 3.5983 2.8645 3.9121 2.8904 5.3001 1.0750 2.9625 4.2633 4.4843 4.0466 5.3245 5.1533 2.9176 4.9350 1.4671 2.0060 1.2989 1.6378 3.3469 4.6925 5.3785 4.9924 5.0340 1.8719 1.1619 1.8553 3.9206 1.2447 1.4525 1.3780 1.3676 1.4101 4.4426 2.3926 3.0500 2.1455 1.5432 1.3759 2.5355 1.0558 1.1121 1.9130 1.4206 1.3433 3.4367 1.4121 1.1144 1.3241 5.9512 1.0866 2.4210 1.1728 2.0215 5.8271 1.1947 6.1221 1.0956 10.4986 1.0695 1.0587 1.0923 1.1077 1.0843 1.0886 1.0929 1.0958 1.1007 1.0451 1.0451 1.0997 1.1038
irintensity: 0.9404 0.2777 0.6427 2.7551 1.4432 2.3120 60.8702 5.4701 2.8650 4.3235 3.9370 3.9085 8.1166 0.4824 8.2142 100.3091 104.2248 314.0135 17.0921 33.4411 17.7231 18.3220 10.6940 29.5452 47.4009 5.3971 55.9901 48.6085 0.2562 9.1211 2.0916 0.2050 0.5877 1.0106 12.8315 2.0090 12.9754 16.3266 6.4268 40.2303 0.4057 5.8174 122.8470 30.8456 4.8018 10.2728 2.4854 1.5440 7.0155 1.0989 8.5249 2.1821 0.9149 44.4652 8.2948 98.3707 89.2827 34.5918 763.7115 50.1902 22.3688 13.6672 12.7693 3.0839 11.4684 33.3480 28.9947 9.7099 1.1126 78.9429 4.5744 34.2798
temp: 298.150 k
press: 1.00000 atm
elementType: 16 7 7 7 6 6 6 6 6 6 6 6 6 1 1 1 1 1 1 1 1 1 1 1 1 1
symmnumber: 1
zpe: 549162.0 jmol-1
zpe.correction: 0.209165 hartree
zpe.thermalcorrener: 0.222629 hartree
zpe.thermalcorrenthalpy: 0.223573 hartree
zpe.thermalcorrgfe: 0.168146 hartree
zpe.sumelectzpe: -912.081481 hartree
zpe.sumelectthermal: -912.068017 hartree
zpe.sumelectthermalent: -912.067073 hartree
zpe.sumelectthermalfe: -912.122500 hartree
dipole: -2.1982 0.6743 -1.5121
dipole: 2.7519
quadrupole: -81.6867 -75.5199 -80.7480
quadrupole: 7.6467 7.6792 0.0180
quadrupole: -2.3685 3.7983 -1.4298 7.6467 7.6792 0.0180
hfenergy: -912.2906461 hartree
pointgroup: C01[X(C9H13N3S1)]
dipole: 0.9234613 -0.0195356 -0.5648639 debye
dipolederiv: -0.4600008 0.1342967 -0.1670456 0.122394 -0.3660399 0.0616256 -0.4079021 0.0802773 -0.2973712 -1.3672224 -0.6341701 -0.1280658 -0.6062741 -0.8915339 0.1736447 -0.5204941 0.0344688 -0.6058788 -0.9077263 0.202417 -0.1021099 0.2418617 -0.5688443 -0.2065124 -0.0860083 -0.2118248 -0.3761447 -1.0441534 -0.3788084 0.2222185 -0.4557822 -1.1316521 0.0901162 0.4069047 0.38993 -0.4668143 0.4327647 -0.2977229 -0.0672612 -0.2216397 0.180161 -0.0164104 -0.1077023 0.0420391 0.0234981 0.313515 -0.074713 0.0120684 -0.4000357 0.4447875 0.1145737 -0.0875553 0.1498473 0.2446231 0.7765709 0.5018621 -0.032949 0.7110494 0.5758542 -0.0551377 -0.1925181 -0.1762512 0.1339152 -0.2826921 -0.0617512 0.0250064 -0.0176241 -0.1007998 0.0077208 0.1700903 0.1996374 -0.061049 -0.2247004 -0.0158126 -0.0384438 -0.1489676 -0.2439877 0.0492031 -0.0814537 -0.0534007 0.0561689 1.5992089 0.7639085 0.3451196 0.7503218 1.1673426 -0.4183635 0.7739523 -0.5124553 0.8062791 -0.060602 0.0935193 -0.0657795 0.088364 -0.0128555 0.0424339 -0.1139407 0.0112057 0.122549 -0.0641706 0.0982018 -0.0260862 0.1552499 0.0419879 0.0654365 -0.0042343 0.0896029 0.0732854 -0.1442149 0.0801977 -0.052938 0.0464274 -0.096931 -0.0276399 -0.008442 -0.0060355 -0.1204268 0.0030777 -0.0124786 0.053976 0.0021085 -0.0306058 0.0414609 0.1373416 0.0508304 -0.022278 -0.030925 0.0049617 -0.095394 0.0742357 0.0603364 0.0219673 -0.0540065 -0.0400172 0.003044 0.0317259 -0.0206341 0.0655952 -0.0268314 -0.0057567 0.0532232 0.0616948 0.0787462 -0.0335294 -0.1339986 0.0407669 -0.0806781 0.076537 -0.0002547 -0.0037783 -0.1420646 0.0025612 -0.0386838 0.1364888 -0.0860208 -0.0410953 -0.0843078 0.0113509 -0.0731801 -0.0293006 -0.0670223 0.0232115 0.1255048 -0.0273368 0.0910389 -0.0279822 0.1087332 0.016382 0.0758207 -0.0029778 -0.0587118 0.0771528 -0.0356691 0.0834725 -0.0466514 0.0996133 -0.0158874 0.120108 0.0055603 -0.0955198 0.0854952 -0.0800518 -0.0324761 -0.1001906 0.0039241 -0.1147273 -0.0498786 -0.1198586 -0.0146235 0.0216627 -0.1408819 0.053403 -0.1593901 0.0022862 0.0254691 0.0612818 0.0291025 0.0773317 0.2870472 0.0648209 0.0420978 0.0658628 0.1650874 0.0527739 0.1146442 0.0365609 0.0526065 0.2917846 -0.062164 0.0868912 0.0637845 0.0167986 0.0105781 0.1647021 -0.0679671 0.2162099 0.2492756 -0.0574599 -0.0855005 -0.0382526 0.2606885 0.0700781 -0.152446 0.0373191 0.1721245 0.2891316 0.0007226 -0.0650646 -0.0642671 0.3103094 0.0349497 -0.0485933 0.0201213 0.1861842 unknown
polarizability: 165.8357329|37.4035529|138.2697183|-2.775185|1.3827862|123.405365 unknown
InChI: InChI=1S/C9H13N3S/c10-6-7-13-9(11)12-8-4-2-1-3-5-8/h1-5H,6-7,10-11H2
charge 0 multiplicity 1
26 atoms
S  1.641905 1.156089 1.4382
N  -0.17716 1.268241 -0.804658
N  3.762356 -2.003808 -0.314427
N  1.62137 2.757698 -0.775811
C  3.079451 0.122612 0.717495
C  2.607074 -1.253058 0.206346
C  -1.074396 0.275018 -0.36095
C  -1.598498 0.231667 0.963214
C  -1.532214 -0.67848 -1.313449
C  0.874972 1.736051 -0.21162
C  -2.539281 -0.757351 1.321545
C  -2.464495 -1.669517 -0.9433
C  -2.973731 -1.716877 0.376945
H  3.55129 0.713521 -0.086117
H  3.798176 0.004113 1.545076
H  2.167117 -1.813236 1.050315
H  1.791788 -1.108697 -0.536413
H  -1.278061 0.978948 1.695987
H  -1.146186 -0.619653 -2.336519
H  -2.93735 -0.775565 2.34275
H  -2.801196 -2.400255 -1.687758
H  -3.70569 -2.480884 0.661107
H  4.053674 -1.769117 -1.265158
H  3.771191 -3.006128 -0.123228
H  1.314088 3.155286 -1.663728
H  2.354607 3.205784 -0.232442
