program: Gaussian 09
title: 000085921
version: EM64L-G09RevD.01
frameworkgroup: C1[X(C9H11NS)]
method: RPBEPBE
basis: SDD
operation: Freq
keyword: #p
keyword: freq=noraman
keyword: PBEPBE/SDD
title: #p freq=noraman PBEPBE/SDD
converged: YES YES NO NO
title: Mulliken charges:
elementType: S N C C C C C C C C C H H H H H H H H H H H
charge: 0.166693 -0.633229 -0.203453 -0.403384 0.594179 -0.658084 -0.411765 -0.395155 -0.258543 -0.257669 -0.234211 0.218196 0.206340 0.228587 0.251074 0.293641 0.235095 0.296563 0.266733 0.241186 0.228095 0.229111
chargesum: 0.00000
title: Mulliken charges with hydrogens summed into heavy atoms:
elementType: S N C C C C C C C C C
charge: 0.166693 -0.069934 0.014743 0.031543 0.594179 -0.113369 -0.411765 -0.160059 -0.017358 -0.029574 -0.005099
polarizability: 1.57283300e+02 -2.86680631e+00 1.23086664e+02 -1.01584778e+00 -4.52620934e+00 6.66618451e+01
1716.lowfreq: -5.4362 0.0007 0.0019 0.0032 6.3939 16.0716 63.1408 113.0957 179.7916
frequency: 63.0448 113.0872 179.7861 207.0095 242.3744 296.1098 326.5487 343.3790 383.5574 433.3830 465.1511 516.3930 545.5940 567.5518 631.0271 651.5459 677.4470 738.2351 759.1395 786.6529 865.8961 879.9027 930.5660 946.1932 946.7410 979.1174 1032.2582 1045.0054 1061.9439 1068.3676 1124.6342 1151.2398 1156.6217 1173.1064 1189.6151 1219.8463 1261.2884 1296.1163 1312.7631 1351.4981 1372.8662 1382.9907 1424.8040 1430.2764 1451.9909 1467.4794 1576.8514 1600.0400 1626.6925 2884.5276 2982.1285 3036.7630 3047.4739 3108.5878 3116.8346 3126.3583 3142.4414 3162.7876 3454.0122 3592.0618
redmass: 3.7035 3.9851 3.9277 1.1995 2.2361 4.0751 4.0410 3.4707 3.9247 4.7621 3.2740 3.6011 2.3484 1.6346 5.4717 4.4892 3.3866 3.1211 1.4446 2.8307 1.3855 3.1313 1.9986 1.4200 1.8022 1.3205 3.6839 3.0161 1.9266 1.9403 1.7002 1.4538 1.2547 1.0671 1.4148 1.5142 1.4461 1.2033 1.3910 1.5571 2.3799 2.7799 1.2389 1.7412 1.0957 2.3967 6.6769 5.7949 1.1118 1.0826 1.0625 1.0643 1.0916 1.0882 1.1084 1.0870 1.0933 1.1006 1.0451 1.0983
irintensity: 0.4432 1.3274 2.9646 25.2082 10.8493 2.1841 0.2721 3.4185 1.1435 6.2095 2.1807 7.1643 49.3874 116.5521 1.2805 4.5247 32.1349 16.8883 68.0802 2.4249 0.1473 5.0395 10.4445 0.5225 12.4659 0.0290 28.2161 9.1011 2.4218 18.4558 4.7276 2.9953 4.7054 0.7022 5.0921 7.9152 5.7003 20.2401 17.7311 7.8325 2.4015 4.9397 3.2627 26.1737 11.6317 36.0826 14.6049 20.0750 54.2584 71.9314 50.4867 17.1808 36.3239 11.7335 6.8599 2.5538 20.8016 29.7447 1.8811 1.1918
temp: 298.150 k
press: 1.00000 atm
elementType: 16 7 6 6 6 6 6 6 6 6 6 1 1 1 1 1 1 1 1 1 1 1
symmnumber: 1
zpe: 471972.9 jmol-1
zpe.correction: 0.179765 hartree
zpe.thermalcorrener: 0.189675 hartree
zpe.thermalcorrenthalpy: 0.190619 hartree
zpe.thermalcorrgfe: 0.144543 hartree
zpe.sumelectzpe: -801.554878 hartree
zpe.sumelectthermal: -801.544967 hartree
zpe.sumelectthermalent: -801.544023 hartree
zpe.sumelectthermalfe: -801.590099 hartree
dipole: 0.5205 2.7391 -0.4067
dipole: 2.8176
quadrupole: -63.6379 -67.2791 -76.6538
quadrupole: 3.4639 -2.0847 0.4331
quadrupole: 5.5524 1.9112 -7.4635 3.4639 -2.0847 0.4331
hfenergy: -801.7346425 hartree
pointgroup: C01 [X(C9H11N1S1)]
dipole: -0.3045913 1.0449171 0.2103528 debye
dipolederiv: -0.4623612 -0.1739019 0.0043725 -0.3066158 -0.203784 -0.0410786 0.0182109 -0.0075127 -0.1157433 -0.3894227 -0.0295072 -0.1693803 -0.0333123 -0.5210767 0.0192342 -0.1618102 0.0439547 -0.6466852 0.2752203 -0.0621351 0.0360454 -0.0580358 0.4082482 -0.1467593 0.0555018 -0.0638033 0.5636836 -0.0772519 -0.0077643 0.0617717 0.0077894 -0.0395933 -0.0165448 -0.054105 0.0093861 0.0575058 -0.119536 -0.1020298 -0.0200855 -0.3313539 -0.2117858 0.0062283 0.0230828 0.0135372 -0.0906223 0.358563 -0.1444611 -0.0218802 -0.1667877 0.0069939 -0.0243155 -0.0333449 -0.0122368 0.0768252 0.5982918 0.5347596 0.0560718 0.58965 0.2817935 0.0377599 0.0570772 0.0269353 -0.0622878 0.1090666 0.0030225 -0.0025939 0.0289008 0.0774446 0.0501889 -0.0092296 0.0503894 -0.1473791 -0.3620585 -0.2119062 -0.0312699 -0.1194334 0.0190836 0.0333617 -0.0249553 0.0376421 -0.1199436 -0.1036549 0.0827466 0.0144999 0.046716 -0.0956565 0.0219045 0.0019382 0.0171447 -0.1804164 0.1311508 0.0070828 -0.0150761 0.0259112 0.1099074 0.0517956 -0.005938 0.0466677 -0.1451415 -0.0089113 -0.029539 -0.0407049 0.0010213 -0.1180598 -0.134555 -0.0460908 -0.0769945 -0.1826207 -0.1459516 0.0941328 0.0407413 0.1600301 -0.0124907 -0.0492397 0.039516 -0.042609 0.0819569 0.0934562 -0.0087171 -0.0803125 -0.0272183 0.0226326 0.0797965 -0.0334644 0.0414323 -0.1184549 -0.088882 -0.0886321 0.0257835 -0.0683896 -0.0183714 0.021745 0.0504313 0.0283195 0.0926442 -0.0087257 0.0525973 -0.0205584 0.1166717 0.1021738 0.0495934 -0.0272757 -0.0013999 -0.0407553 0.0725795 0.0556263 0.0238579 0.0165491 -0.1093416 -0.051026 0.0086189 -0.0607744 0.1258466 0.0998921 -0.0794209 0.0837594 -0.0543148 0.1789846 0.1302623 0.0614191 0.0243041 0.2142889 0.1121518 0.1480191 0.0411707 0.176877 0.130809 0.056873 0.0588517 0.0173994 0.1761579 0.0972454 -0.0051365 0.0009657 0.0373347 -0.0750034 -0.0453252 0.0061853 -0.0435681 0.1448323 -0.0594591 -0.1001689 -0.0107222 -0.1145016 0.0050199 -0.0285124 -0.0115827 -0.0288243 0.1619644 -0.1214026 0.0653332 0.0235441 0.0725117 0.0620724 -0.0213867 0.0269635 -0.0193897 0.1543442 unknown
polarizability: 156.4597092|6.0351414|123.3521738|-0.9763335|7.175268|67.219926 unknown
InChI: InChI=1S/C9H11NS/c10-8-5-6-11-9-4-2-1-3-7(8)9/h1-4,8H,5-6,10H2
charge 0 multiplicity 1
22 atoms
S  -0.980367 -2.099214 -0.232396
N  -1.700702 1.727815 -0.956051
C  -1.27463 1.152923 0.346941
C  -2.345887 0.145422 0.833408
C  0.115395 0.532166 0.189601
C  -2.525459 -1.008525 -0.157489
C  0.343595 -0.844059 -0.083831
C  1.241314 1.38792 0.311163
C  1.670231 -1.32983 -0.228326
C  2.560659 0.913815 0.161546
C  2.771203 -0.459062 -0.110901
H  -1.183263 1.939293 1.134093
H  -3.313432 0.678375 0.931921
H  -2.075173 -0.23901 1.8354
H  -3.331493 -1.697025 0.143606
H  -2.708786 -0.608999 -1.167213
H  1.066624 2.447754 0.539636
H  -0.931807 2.072135 -1.537601
H  -2.481308 2.389735 -0.892645
H  1.834853 -2.393089 -0.437361
H  3.410002 1.597673 0.26222
H  3.78723 -0.852011 -0.22862
