program: Gaussian 09
title: 000085906
version: EM64L-G09RevD.01
frameworkgroup: C1[X(C10H14N2O)]
method: RPBEPBE
basis: SDD
operation: Freq
keyword: #p
keyword: freq=noraman
keyword: PBEPBE/SDD
title: #p freq=noraman PBEPBE/SDD
converged: YES YES NO NO
title: Mulliken charges:
elementType: O N N C C C C C C C C C C H H H H H H H H H H H H H H
charge: -0.280782 -0.016463 -0.005063 -0.445775 -0.147529 -0.410127 -0.364232 0.477679 -0.615387 -0.376181 -0.470367 -0.180850 -0.340836 0.225879 0.221450 0.219570 0.218367 0.214483 0.203437 0.217546 0.208510 0.249573 0.218017 0.243023 0.265884 0.229722 0.240454
chargesum: 0.00000
title: Mulliken charges with hydrogens summed into heavy atoms:
elementType: O N N C C C C C C C C C C
charge: -0.280782 -0.016463 -0.005063 0.001554 0.072041 0.022723 0.056751 0.477679 0.060713 -0.133158 -0.204483 0.048871 -0.100382
polarizability: 1.67321474e+02 2.85022112e-01 9.86759088e+01 -3.87172629e+00 1.14766232e+01 9.97713691e+01
1716.lowfreq: -13.1788 -8.3046 -0.0005 0.0002 0.0004 1.8045 21.5840 80.4154 84.0448
frequency: 21.1228 80.4021 84.0361 153.3149 208.4758 227.6118 264.4138 269.0308 283.8989 340.1295 396.2893 409.1676 447.5092 488.0190 524.4396 532.2913 608.6116 641.7701 722.2723 744.4568 792.6560 817.5357 835.8069 865.2387 901.7812 924.3603 927.8859 940.2390 950.4047 984.9593 1007.0324 1017.1048 1028.4229 1045.2753 1089.7082 1095.8045 1112.3500 1131.1882 1174.6309 1192.8384 1194.8432 1206.9393 1217.1541 1256.8153 1289.7935 1303.8099 1316.3531 1331.8349 1339.5835 1349.3984 1355.4281 1412.3426 1414.5464 1439.8349 1448.6680 1451.5893 1455.7706 1458.9080 1479.9792 1558.1828 1588.8605 2912.6327 2930.9003 2970.8256 2986.5687 2993.5743 3034.4617 3046.4542 3054.8756 3062.2484 3111.5392 3124.6795 3132.5542 3144.2393 3164.0937
redmass: 3.9536 4.2301 3.6645 2.6855 1.8464 1.6336 3.2869 2.3204 2.9954 2.7605 3.2129 4.1066 2.7517 3.2784 4.1240 2.1155 6.9128 5.2397 1.9194 4.3287 2.4184 1.9789 2.5622 2.9245 1.9226 2.5535 1.3583 1.9030 2.1221 1.4081 3.5956 2.2554 3.0293 2.4614 1.7103 2.1613 1.5395 1.5840 1.5310 1.6517 1.7947 1.4404 1.6479 1.2321 1.9875 1.4096 2.5950 1.2706 1.3793 1.3717 1.5361 1.1728 2.0314 1.0707 1.0855 1.0868 1.3355 1.5895 1.0499 5.5905 5.9536 1.0661 1.0470 1.0835 1.0596 1.0628 1.0924 1.1010 1.0852 1.1035 1.1002 1.0877 1.0916 1.0920 1.0999
irintensity: 1.8653 0.0666 1.8222 5.9179 1.4874 0.1318 2.0955 0.0977 0.7848 3.3256 3.1713 0.6583 2.7431 1.6864 2.3793 2.4400 1.2933 2.7632 37.6554 16.6120 18.3156 25.9144 2.8619 12.7495 2.8378 14.8238 0.7051 34.1291 16.5916 0.1895 6.6068 27.3720 0.2171 8.5732 6.6662 5.2393 3.2183 2.0220 1.8776 0.8846 3.5718 12.3211 0.0450 5.1036 2.0805 12.1091 2.7616 1.3237 0.2173 4.5245 0.1545 2.8056 26.0647 12.6541 1.3068 16.3672 19.5754 13.2740 12.8605 6.6312 0.6019 49.5365 97.7392 23.0466 29.5069 30.6295 32.1971 21.9852 32.4245 59.9277 18.2017 2.3459 25.8456 15.1141 27.4352
temp: 298.150 k
press: 1.00000 atm
elementType: 8 7 7 6 6 6 6 6 6 6 6 6 6 1 1 1 1 1 1 1 1 1 1 1 1 1 1
symmnumber: 1
zpe: 591091.4 jmol-1
zpe.correction: 0.225135 hartree
zpe.thermalcorrener: 0.236883 hartree
zpe.thermalcorrenthalpy: 0.237828 hartree
zpe.thermalcorrgfe: 0.186494 hartree
zpe.sumelectzpe: -573.138690 hartree
zpe.sumelectthermal: -573.126942 hartree
zpe.sumelectthermalent: -573.125997 hartree
zpe.sumelectthermalfe: -573.177331 hartree
dipole: 2.0730 2.4260 1.2840
dipole: 3.4397
quadrupole: -68.3129 -77.7009 -79.4036
quadrupole: -5.0789 -9.8122 -0.2740
quadrupole: 6.8263 -2.5618 -4.2645 -5.0789 -9.8122 -0.2740
hfenergy: -573.3638249 hartree
pointgroup: C01 [X(C10H14N2O1)]
dipole: -0.8389358 -0.9732205 0.424725 debye
polarizability: 167.2477702|-1.3809129|100.4944591|4.0214453|-11.5107668|98.0265225 unknown
InChI: InChI=1S/C10H14N2O/c1-12-7-3-5-10(13-12)9-4-2-6-11-8-9/h2,4,6,8,10H,3,5,7H2,1H3
charge 0 multiplicity 1
27 atoms
O  -1.185683 0.803405 0.172666
N  -2.645492 0.556891 0.55394
N  2.792003 0.906431 -1.096198
C  -0.992333 -1.523484 -0.630388
C  -0.4624 -0.475148 0.383072
C  -2.526989 -1.669859 -0.507791
C  -3.21502 -0.28982 -0.538778
C  1.012616 -0.178319 0.206381
C  -3.214575 1.922821 0.581009
C  1.981775 -0.734412 1.07467
C  1.474167 0.638275 -0.860046
C  3.350856 -0.474166 0.843612
C  3.708484 0.345277 -0.251159
H  -0.490128 -2.494484 -0.458846
H  -0.721681 -1.187533 -1.650294
H  -0.669579 -0.822638 1.416948
H  -2.917121 -2.302398 -1.32683
H  -2.780054 -2.166372 0.448696
H  -3.085532 0.196233 -1.534028
H  -4.297631 -0.393917 -0.334552
H  -3.135045 2.447632 -0.396845
H  -2.683851 2.510301 1.346185
H  -4.278812 1.840312 0.865123
H  1.668767 -1.357737 1.920909
H  0.757471 1.112246 -1.539116
H  4.124756 -0.889324 1.497021
H  4.759132 0.571289 -0.46726
