program: Gaussian 09
title: 000085889
version: EM64L-G09RevD.01
frameworkgroup: C1[X(C10H21NO)]
method: RPBEPBE
basis: SDD
operation: Freq
keyword: #p
keyword: freq=noraman
keyword: PBEPBE/SDD
title: #p freq=noraman PBEPBE/SDD
converged: YES YES NO NO
title: Mulliken charges:
elementType: O N C C C C C C C C C C H H H H H H H H H H H H H H H H H H H H H
charge: -0.449285 -0.591032 0.438581 0.336829 -0.530054 -0.491689 -0.477432 -0.106503 -0.512601 -0.758801 -0.738467 -0.749003 0.181737 0.213590 0.219952 0.201399 0.208001 0.182999 0.207331 0.202292 0.212810 0.209248 0.197501 0.248383 0.213367 0.205915 0.212683 0.212535 0.212029 0.209927 0.327311 0.271950 0.278498
chargesum: 0.00000
title: Mulliken charges with hydrogens summed into heavy atoms:
elementType: O N C C C C C C C C C C
charge: -0.121974 -0.040584 0.438581 0.336829 -0.134726 -0.070338 -0.086432 0.100828 -0.097500 -0.103669 -0.106502 -0.114512
polarizability: 1.27655324e+02 -7.33199879e-01 1.16623536e+02 -9.33680935e-01 -7.97988268e-02 1.02205125e+02
1716.lowfreq: -9.5727 0.0008 0.0008 0.0009 4.7389 18.4698 99.0821 114.7092 123.7855
frequency: 99.0426 114.6897 123.7445 153.7588 170.5479 176.6052 218.8837 221.0800 230.7842 266.1526 277.3260 297.5861 304.9395 326.3084 341.5039 361.0020 392.4729 408.7091 446.4405 446.8268 481.1791 518.6987 543.4022 615.5853 764.5701 779.4514 857.7259 868.4185 873.6849 888.9270 910.0227 924.0040 938.1369 954.5880 967.5956 977.6955 1007.8332 1018.3494 1058.5073 1063.5243 1091.0540 1105.2353 1111.0883 1147.3985 1188.8659 1198.4406 1226.8169 1240.4401 1262.4802 1278.4541 1282.0921 1299.4421 1309.9506 1331.2408 1340.2362 1353.8117 1358.0323 1372.5084 1382.1885 1393.0546 1397.5738 1452.6414 1455.6994 1461.2132 1462.8406 1467.0025 1472.6439 1477.8055 1478.6975 1489.4571 1497.1773 1641.4227 2879.7226 2932.6755 2950.7017 2953.4473 2961.4900 2967.1717 2973.3495 2977.6237 3011.1652 3016.0580 3016.6182 3037.9351 3054.9503 3060.4900 3063.2116 3067.8315 3084.4823 3100.0801 3488.8960 3545.9611 3613.8643
redmass: 2.6189 2.6296 2.3593 2.6526 1.1157 1.2764 1.5211 1.3386 1.4777 2.0087 2.0991 1.6435 1.5300 2.6418 2.3651 3.6500 2.6004 2.5780 2.0811 2.0846 2.7314 2.3275 1.4920 2.1935 3.3710 3.2491 1.7439 1.5376 1.6149 2.2977 2.1262 1.6505 1.6470 2.1622 2.0130 1.6376 2.0468 1.5159 1.8672 1.5311 1.7256 1.8506 1.6840 1.6183 2.3883 1.6229 2.1707 2.1638 2.2297 1.3410 1.3618 1.3772 1.4185 1.6803 1.3610 1.3997 1.3202 1.2254 1.2319 1.2054 1.5880 1.0792 1.0732 1.0829 1.0586 1.0679 1.0705 1.0628 1.0669 1.0618 1.0557 1.0937 1.0695 1.0630 1.0656 1.0746 1.0358 1.0633 1.0374 1.0396 1.0957 1.0929 1.0986 1.0995 1.0995 1.0987 1.0990 1.0954 1.0984 1.0970 1.0451 1.0659 1.0986
irintensity: 2.9119 1.4979 2.5688 5.1755 12.7222 31.0596 4.8167 2.7804 1.4276 10.7770 0.8466 58.6093 69.9830 1.0725 2.1053 3.7597 5.4370 2.7483 2.2677 0.6257 3.3946 2.0304 152.8853 51.5134 4.0627 2.9435 1.8053 3.0601 3.2214 7.1518 6.9555 9.0057 14.1582 25.2714 21.0589 4.7497 27.9504 4.8398 4.9874 13.6900 18.7792 21.1701 3.5586 1.3414 5.0407 14.7813 31.3516 7.5972 7.6193 2.3273 2.8416 9.5641 7.5102 10.8865 11.8840 18.7827 10.4404 8.3911 26.8496 15.3040 8.7902 0.9093 2.7007 2.7806 1.0827 4.2382 11.2717 7.3221 13.6152 9.2547 21.6197 49.5681 78.5050 43.9138 46.5577 9.4648 43.8919 59.6002 35.6193 29.9467 20.1018 33.6913 34.4311 54.9282 4.7575 66.9031 70.5805 45.1461 32.4396 29.8501 0.2813 2.7749 1.9122
temp: 298.150 k
press: 1.00000 atm
elementType: 8 7 6 6 6 6 6 6 6 6 6 6 1 1 1 1 1 1 1 1 1 1 1 1 1 1 1 1 1 1 1 1 1
symmnumber: 1
zpe: 778619.6 jmol-1
zpe.correction: 0.296561 hartree
zpe.thermalcorrener: 0.310909 hartree
zpe.thermalcorrenthalpy: 0.311854 hartree
zpe.thermalcorrgfe: 0.257875 hartree
zpe.sumelectzpe: -522.621888 hartree
zpe.sumelectthermal: -522.607539 hartree
zpe.sumelectthermalent: -522.606594 hartree
zpe.sumelectthermalfe: -522.660573 hartree
dipole: -0.1775 -1.6553 -0.3433
dipole: 1.6998
quadrupole: -66.0087 -83.1108 -77.9230
quadrupole: -0.7672 5.4279 3.7514
quadrupole: 9.6722 -7.4300 -2.2422 -0.7672 5.4279 3.7514
hfenergy: -522.9184481 hartree
pointgroup: C01 [X(C10H21N1O1)]
dipole: -0.0603538 -0.6504046 -0.1433941 debye
polarizability: 127.6995934|-0.6338881|116.6124734|-0.2088504|0.0389891|102.1719181 unknown
InChI: InChI=1S/C10H21NO/c1-9(2)4-8(12)5-10(3,6-9)7-11/h8,12H,4-7,11H2,1-3H3
charge 0 multiplicity 1
33 atoms
O  1.929083 2.605117 -0.255655
N  -3.385847 -0.660703 -0.497671
C  -1.118776 0.319015 0.102667
C  1.100218 -1.189989 -0.030668
C  -0.418993 -1.000765 -0.357085
C  -0.223859 1.536936 -0.265612
C  1.86873 0.118125 -0.389235
C  1.226196 1.385985 0.207067
C  -2.453473 0.462412 -0.705603
C  -1.482884 0.317067 1.60962
C  1.359338 -1.58914 1.450183
C  1.636908 -2.34456 -0.921736
H  -0.508947 -1.046121 -1.465584
H  -0.982228 -1.86631 0.045335
H  -0.649533 2.467194 0.157473
H  -0.194856 1.664427 -1.368247
H  1.88865 0.246179 -1.491281
H  2.923638 0.028148 -0.051476
H  1.267695 1.346574 1.317001
H  -2.18681 0.610738 -1.780145
H  -2.958516 1.389761 -0.371269
H  -0.609487 0.179448 2.267143
H  -1.960277 1.277366 1.886656
H  -2.207659 -0.491984 1.808928
H  0.717424 -2.440666 1.74405
H  2.414148 -1.899472 1.58029
H  1.168602 -0.765571 2.158141
H  1.11181 -3.292836 -0.696886
H  1.491715 -2.121411 -1.995679
H  2.718204 -2.508136 -0.750638
H  2.887375 2.526893 -0.013141
H  -3.173384 -1.503063 -1.03706
H  -4.377304 -0.416457 -0.528883
