program: Gaussian 09
title: 000085915
version: EM64L-G09RevD.01
frameworkgroup: C1[X(C8H14ClNO2)]
method: RPBEPBE
basis: SDD
operation: Freq
keyword: #p
keyword: freq=noraman
keyword: PBEPBE/SDD
title: #p freq=noraman PBEPBE/SDD
converged: YES YES NO NO
title: Mulliken charges:
elementType: Cl O O N C C C C C C C C H H H H H H H H H H H H H H
charge: -0.008490 -0.252678 -0.209041 -0.111024 -0.351846 -0.403653 0.300886 -0.627483 -0.656080 -0.643567 0.280078 -0.746414 0.210715 0.260552 0.229577 0.268158 0.316440 0.252374 0.209107 0.220598 0.224219 0.221148 0.225755 0.285902 0.246507 0.258261
chargesum: 0.00000
title: Mulliken charges with hydrogens summed into heavy atoms:
elementType: Cl O O N C C C C C C C C
charge: -0.008490 -0.252678 -0.209041 -0.111024 0.119420 0.094082 0.300886 -0.311042 0.025999 0.027554 0.280078 0.044257
polarizability: 1.25963466e+02 -4.23923527e+00 9.98551756e+01 -8.33620510e+00 4.19427268e+00 1.02645111e+02
1716.lowfreq: -10.0782 -1.0886 -0.0023 -0.0014 0.0020 11.9275 30.6646 53.5915 64.5460
frequency: 30.2984 53.4635 64.4991 71.9253 86.6901 125.3809 155.9654 162.8975 183.4096 198.9001 217.0615 229.2087 267.0814 322.1836 356.0782 378.8393 423.0945 493.5993 505.0867 512.4567 601.0965 674.2204 732.6317 773.5281 784.8586 796.6710 827.0700 894.3763 942.4602 987.4455 1015.7027 1028.9859 1073.0252 1079.6402 1096.7619 1127.4284 1190.2896 1204.5420 1224.4064 1231.9170 1263.1957 1298.4021 1345.8586 1359.4067 1376.6143 1389.1203 1392.5545 1403.3719 1437.8845 1444.5960 1458.3700 1468.0547 1469.8244 1480.3291 1484.0220 1511.4739 1598.2381 1613.5137 2985.1725 2988.0651 2988.7584 3007.5082 3012.2366 3060.2541 3073.0187 3073.1109 3085.5440 3088.7197 3089.7961 3105.0922 3125.2829 3127.8169
redmass: 5.2478 4.5984 4.5812 2.9550 2.9873 3.9093 1.8700 1.7067 2.5926 4.1542 1.0355 1.5481 2.8267 2.9113 3.3631 7.7390 2.7187 3.7820 3.6167 3.1660 3.4423 6.3342 3.6543 2.2587 1.1858 1.7181 3.9971 2.4900 2.1598 1.8621 2.8422 1.8034 2.1230 1.8214 1.7882 1.8735 1.9996 2.9413 1.5225 1.4354 1.5098 1.2826 1.2436 1.2810 1.2509 1.2266 1.2113 2.3604 1.0596 1.0814 1.0959 1.0451 1.0447 1.0490 1.0561 1.0987 6.6054 7.6276 1.0357 1.0359 1.0365 1.0632 1.0631 1.1011 1.0984 1.0970 1.0999 1.0990 1.1014 1.1023 1.0874 1.1007
irintensity: 2.9770 0.5692 7.9483 2.2630 0.4803 0.4379 0.1076 1.3498 0.2367 6.7754 0.1476 3.6032 2.7039 2.4144 9.5672 0.9435 4.0729 27.9921 3.4349 2.3343 11.5017 5.9724 16.5794 18.5434 8.6743 6.5923 8.6373 6.9519 7.8686 9.5051 2.5570 0.8719 12.0013 6.2061 26.8881 47.8522 102.1063 36.6162 42.9318 50.7721 32.0394 19.9073 2.3870 11.5149 90.3678 15.1229 29.6132 58.3119 26.2945 29.9880 22.2999 3.6410 16.1901 5.7930 13.4357 13.9287 215.7022 113.5940 18.9406 23.0916 2.8387 23.8377 31.8283 0.8107 5.4242 3.5194 36.2403 52.5167 14.5661 26.2507 4.0220 6.2206
temp: 298.150 k
press: 1.00000 atm
elementType: 17 8 8 7 6 6 6 6 6 6 6 6 1 1 1 1 1 1 1 1 1 1 1 1 1 1
symmnumber: 1
zpe: 554650.9 jmol-1
zpe.correction: 0.211255 hartree
zpe.thermalcorrener: 0.225983 hartree
zpe.thermalcorrenthalpy: 0.226927 hartree
zpe.thermalcorrgfe: 0.168348 hartree
zpe.sumelectzpe: -977.551652 hartree
zpe.sumelectthermal: -977.536925 hartree
zpe.sumelectthermalent: -977.535980 hartree
zpe.sumelectthermalfe: -977.594560 hartree
dipole: -3.1016 1.1771 1.0829
dipole: 3.4897
quadrupole: -69.7273 -77.5633 -91.7251
quadrupole: -3.5894 0.3050 -1.7788
quadrupole: 9.9446 2.1086 -12.0532 -3.5894 0.3050 -1.7788
hfenergy: -977.7629077 hartree
pointgroup: C01 [X(C8H14Cl1N1O2)]
dipole: 1.2493824 0.4461179 -0.3536227 debye
dipolederiv: -0.2946073 0.0228166 0.1481249 0.0156997 -0.1122893 -0.0396969 0.1797111 -0.0505119 -0.3982825 -0.7354735 -0.0392307 0.0553933 -0.2769746 -0.882031 0.260261 0.1753973 0.1974683 -0.4141454 -0.4446917 -0.1732589 -0.0646096 -0.1261078 -0.5190595 0.1808234 -0.1302327 0.2520308 -0.81904 -1.0866588 -0.2095055 0.1696214 -0.032943 -0.6704141 -0.0440908 0.1676267 0.0492916 -0.3709907 0.3933658 -0.1610242 -0.0147165 -0.2708464 0.3550372 0.1013732 0.1092201 0.0894568 0.2007801 0.1496567 0.1513483 -0.0256149 0.2382842 0.5203126 -0.0074045 -0.079386 -0.0477666 0.2217502 1.5527567 0.1858026 -0.1893897 0.1002367 0.8763621 -0.3552068 -0.3526343 -0.2752747 0.1729112 -0.1115138 0.1040801 -0.5116864 0.1027347 -0.0188381 0.0118549 -0.599351 0.1247766 0.2507639 -0.0248414 0.0136001 -0.0036037 0.0479801 -0.0184007 -0.0746371 -0.0312508 -0.1064714 -0.0283527 0.0542535 -0.0532113 -0.0220511 -0.0709388 -0.0650869 -0.0518554 -0.0135222 -0.083499 -0.0223447 0.6203325 0.4087513 0.3589014 0.4957163 0.5168551 -0.0610521 0.4865865 -0.291647 0.9602629 -0.3256189 -0.2688222 -0.0242104 -0.2633085 -0.2416656 0.0430212 -0.0044868 0.0825531 -0.041017 -0.1214824 -0.06142 -0.0396121 -0.082918 -0.0191122 -0.0817523 -0.0236942 -0.0515678 0.0693209 0.1024449 -0.025967 0.0732349 0.0573658 0.0091194 0.0432575 -0.003564 0.0416126 -0.0385915 -0.0563445 -0.0036179 0.1244467 0.0080325 0.0236858 -0.071515 0.1044064 -0.0320384 -0.0092821 0.0403296 0.045596 -0.0988912 -0.000637 -0.0111465 0.0076833 -0.0522458 0.0159106 0.0515755 0.0436962 -0.0502818 0.0369468 -0.0383064 -0.0203267 -0.0210505 0.049603 0.0238713 -0.020563 -0.036593 -0.1160653 -0.044727 -0.0793685 0.0486131 -0.0306224 -0.0123266 -0.0054972 0.0705631 0.0951303 -0.0227137 0.0285609 -0.0465588 0.0035975 0.1290198 0.0373492 0.0737 -0.0846972 -0.070299 0.1488359 -0.0102892 0.1643344 -0.0268136 -0.005799 -0.0079625 0.0116919 0.0779274 -0.0477966 0.0571666 0.1183657 0.0244233 0.0736639 -0.0285851 0.097362 -0.0455894 -0.0046702 -0.0575682 0.0439295 -0.1018913 0.1012779 0.0648034 0.0524644 -0.0935553 0.014998 0.0219576 0.0659684 -0.0762609 0.0238572 -0.1034136 -0.1165807 0.0785113 0.0326508 0.0987417 0.0340052 0.1549614 0.0735313 -0.014462 0.0136488 0.0552443 0.0405568 -0.0285192 0.0350873 0.0986796 0.0989911 -0.0223465 -0.0261853 -0.0476814 0.0868095 -0.0294738 -0.0742884 -0.0600416 -0.0699613 0.0416018 0.0282677 0.0544873 0.0702685 0.087661 -0.0460852 0.0671068 -0.0612855 0.0914409 unknown
polarizability: 125.6013404|3.9267726|101.8613306|-9.308034|-3.6889334|101.0010824 unknown
InChI: InChI=1S/C8H14ClNO2/c1-4-10(5-2)8(12)7(9)6(3)11/h7H,4-5H2,1-3H3
charge 0 multiplicity 1
26 atoms
Cl -2.276242 1.01862 1.788503
O  -0.324141 -1.172644 0.906173
O  -1.614477 1.433936 -2.043683
N  1.230403 0.333459 0.042157
C  2.30769 -0.680821 0.199394
C  1.604394 1.625534 -0.593355
C  -0.040979 -0.022408 0.450985
C  -1.151397 1.056052 0.281119
C  2.436406 -1.59998 -1.033213
C  2.070516 2.68706 0.426336
C  -1.934168 0.773187 -1.017225
C  -2.969568 -0.324142 -1.003479
H  3.25299 -0.137554 0.384359
H  2.072603 -1.284979 1.091373
H  2.42337 1.407194 -1.303633
H  0.766837 2.000045 -1.206304
H  -0.757839 2.079356 0.250111
H  1.505435 -2.173148 -1.178901
H  2.642008 -1.021508 -1.952496
H  3.264774 -2.317131 -0.887928
H  1.26018 2.956316 1.127494
H  2.922984 2.317917 1.024235
H  2.390508 3.605489 -0.098556
H  -2.593985 -1.187486 -0.423899
H  -3.225043 -0.613618 -2.034167
H  -3.88206 0.026554 -0.486601
