program: Gaussian 09
title: 000085897
version: EM64L-G09RevD.01
frameworkgroup: C1[X(C8H10N2O4S)]
method: RPBEPBE
basis: SDD
operation: Freq
keyword: #p
keyword: freq=noraman
keyword: PBEPBE/SDD
title: #p freq=noraman PBEPBE/SDD
converged: YES YES NO NO
title: Mulliken charges:
elementType: S O O O O N N C C C C C C C C H H H H H H H H H H
charge: 0.215617 -0.172194 -0.435150 -0.392550 -0.272216 -0.162333 -0.588105 -0.470283 -0.192630 0.119340 0.188394 0.342524 -0.823580 -0.466823 0.146158 0.314247 0.267185 0.297032 0.281649 0.304400 0.297860 0.223746 0.212257 0.373207 0.392249
chargesum: 0.00000
title: Mulliken charges with hydrogens summed into heavy atoms:
elementType: S O O O O N N C C C C C C C C
charge: 0.215617 -0.172194 -0.061943 -0.000301 -0.272216 -0.162333 0.014155 -0.156036 0.074555 0.119340 0.188394 0.342524 -0.244899 -0.030820 0.146158
polarizability: 1.58686724e+02 1.27607220e+01 1.49114488e+02 -1.58214528e+00 8.31336666e-01 8.58638695e+01
1716.lowfreq: -11.8746 -0.0009 0.0011 0.0013 2.9561 6.6027 53.3929 61.8206 94.1013
frequency: 53.2494 61.7820 94.0941 101.7647 120.6701 141.3524 152.7026 192.9900 199.1400 226.0099 245.5731 278.9867 297.5072 351.4198 376.2890 403.4396 442.5096 456.1233 471.7648 523.6307 548.2155 563.0140 609.0135 626.2804 651.6772 664.8478 700.7764 728.5832 743.9844 781.1307 840.7131 870.1208 894.7031 935.9866 944.4046 988.0239 1016.9133 1065.6387 1089.1106 1119.8710 1141.0663 1158.0084 1168.3147 1200.9515 1212.4207 1222.7424 1247.9277 1268.5827 1308.8825 1334.1995 1368.0030 1386.9963 1405.9497 1412.5846 1469.6043 1600.1628 1619.2711 1639.4940 1723.4076 2986.7995 2992.5370 3054.8081 3055.2264 3070.2635 3072.6452 3450.3273 3527.4118 3540.8052 3676.3220
redmass: 5.7216 7.8047 7.5696 8.1265 5.2018 3.5350 5.0098 2.8592 3.7881 2.8422 1.9765 6.2822 3.2448 5.2940 7.3449 6.0849 1.8686 2.9406 4.5721 2.3322 3.7587 3.8209 1.8833 1.2299 3.1281 4.4524 5.4069 6.9026 6.2439 6.7396 2.9470 2.3667 3.2669 2.2955 7.5895 3.2097 6.2729 3.7616 1.4270 1.7415 1.4598 1.6238 1.1208 1.5681 1.6423 1.6849 1.5141 1.7358 2.9979 1.2795 1.8535 1.2286 2.7494 1.1513 1.0918 7.7825 7.7612 1.1000 12.7785 1.0629 1.0598 1.0960 1.0908 1.1002 1.0895 1.0652 1.0644 1.0458 1.1015
irintensity: 0.5300 0.6026 4.2591 0.0797 9.1312 4.5786 2.6370 7.4823 11.0852 17.5468 62.3061 6.7313 1.7059 5.7571 1.0109 16.3441 105.3605 60.2895 3.6475 15.3130 1.8228 27.4628 87.8900 124.4189 104.8156 26.9880 0.4757 4.2580 14.2505 6.0980 13.9496 1.8550 2.2432 44.0498 81.4453 44.7726 165.9024 186.8208 94.9863 30.2751 28.1288 16.6607 2.3484 33.2669 38.5541 21.3856 9.6433 8.8068 50.3546 31.8036 49.6387 120.2362 149.7623 20.0518 8.4102 216.4864 20.7631 83.3484 458.6352 40.1981 26.6620 2.1028 3.5403 26.0329 28.8631 35.9349 62.6142 18.6875 20.4185
temp: 298.150 k
press: 1.00000 atm
elementType: 16 8 8 8 8 7 7 6 6 6 6 6 6 6 6 1 1 1 1 1 1 1 1 1 1
symmnumber: 1
zpe: 477846.7 jmol-1
zpe.correction: 0.182002 hartree
zpe.thermalcorrener: 0.196900 hartree
zpe.thermalcorrenthalpy: 0.197844 hartree
zpe.thermalcorrgfe: 0.140128 hartree
zpe.sumelectzpe: -1118.144056 hartree
zpe.sumelectthermal: -1118.129159 hartree
zpe.sumelectthermalent: -1118.128214 hartree
zpe.sumelectthermalfe: -1118.185930 hartree
dipole: 2.1122 -0.1362 -3.4819
dipole: 4.0747
quadrupole: -93.2526 -94.8760 -93.9940
quadrupole: -1.9516 6.2454 -1.0030
quadrupole: 0.7883 -0.8351 0.0469 -1.9516 6.2454 -1.0030
hfenergy: -1118.3260583 hartree
pointgroup: C01 [X(C8H10N2O4S1)]
dipole: 0.8094925 0.1955895 1.3698485 debye
dipolederiv: -0.1716322 0.0522859 -0.051425 0.0103051 -0.2838915 -0.0584131 -0.0553478 0.0748739 -0.1275369 -0.5147763 -0.0115612 0.0128856 0.4239173 -0.9535129 -0.401521 0.3192347 -0.5765402 -0.580898 -0.8618022 0.0522672 -0.0479588 -0.112153 -0.3094184 -0.0526628 -0.2126958 -0.018084 -0.6171051 -0.4898153 0.3520007 -0.1167268 0.3364439 -0.9511182 0.3648551 -0.0912734 0.3837086 -0.478443 -0.8592704 -0.1624759 -0.273595 -0.2062103 -0.7078173 -0.0281999 -0.2910231 0.0065141 -0.4530368 -1.4635436 0.3900112 0.2470987 0.2167402 -0.6943603 -0.0937586 0.4947129 -0.2744115 -0.4229643 -0.6457515 -0.1375851 0.1586799 -0.3167938 -0.7231759 -0.1126616 0.3229498 -0.0738916 -0.4725667 -0.1097556 0.039916 0.2277415 0.0526903 0.6161504 -0.0449849 0.1617538 -0.0290476 0.3110326 0.5986316 0.0577344 -0.236778 0.2271727 0.2584877 -0.1300337 -0.4872854 -0.1201643 0.3359114 1.2244776 -0.4121033 -0.2774571 -0.8137825 1.0539568 0.6831835 -0.6261848 0.8610458 0.6555399 0.7710363 -0.1296641 -0.043503 0.0195318 -0.6201167 -0.0639662 -0.0476005 -0.1442258 0.0131247 -0.3917994 -0.1702233 0.0631282 0.1756102 0.4092777 -0.0022547 0.1796259 -0.1642008 -0.1338283 0.305266 0.1406713 -0.0741638 -0.0292498 -0.1453101 0.0421754 -0.0490829 -0.0121086 0.128298 0.6245217 -0.1497787 0.0287994 -0.0527827 0.2718631 0.0548002 0.0286828 0.1491599 0.4507334 1.0000231 0.0618535 0.4841977 0.0119646 1.6871517 -0.270684 0.3789197 -0.1250749 0.5350428 0.032285 0.0445234 0.0328633 0.0025214 -0.0289957 0.0128025 -0.0286776 0.0182628 -0.1252097 -0.0452755 0.0338349 -0.0714074 -0.0156935 0.0552497 0.0585447 -0.0719777 0.0483607 -0.0070461 -0.0006037 -0.0019795 -0.0406507 0.0352651 0.0459607 0.025832 -0.0343104 0.0776562 0.0635214 0.0032283 -0.0557651 0.0610206 0.0084186 0.0301534 -0.0335876 0.0896088 -0.0751515 -0.0427705 0.1844946 -0.0065479 -0.062277 -0.0249552 0.3095986 0.043603 -0.0722784 0.0629653 0.1535358 0.1495811 0.0359212 0.0119814 0.1191651 0.2881931 0.0694298 0.0708819 0.0816987 0.2057682 0.0540793 0.0520936 0.0080033 0.0883556 -0.0928098 -0.0981053 -0.0047451 -0.0505519 0.0405828 -0.0442193 -0.0251256 0.0086261 -0.1087345 -0.0226359 0.1387187 0.0035714 0.0647281 -0.0894261 0.4210437 0.0372924 0.0175254 0.0338449 0.1941959 -0.0475553 0.0974178 -0.0390975 0.3167143 0.2295766 -0.0875959 -0.0666082 -0.0815913 0.3129238 -0.0555564 -0.0748766 -0.1264239 0.3410262 unknown
polarizability: 163.5263579|-9.6730168|144.2017444|0.6743922|2.5544449|85.9369796 unknown
InChI: InChI=1S/C8H10N2O4S/c9-4-6(12)10-5(8(13)14)3(1-11)2-15-7(4)10/h4,7,11,13H,1-2,9H2
charge 0 multiplicity 1
25 atoms
S  0.882926 2.491342 -0.158174
O  1.812145 -1.815016 -1.083183
O  -3.574173 0.617102 -1.110052
O  -0.582989 -2.637762 0.678576
O  -2.445715 -1.895781 -0.484392
N  0.651645 -0.227228 0.373139
N  3.56755 0.999743 -0.666091
C  1.422158 0.953953 0.804888
C  2.735948 0.267796 0.24072
C  1.748823 -0.845547 -0.312345
C  -0.752415 -0.289227 0.253719
C  -1.523382 0.856447 0.262805
C  -0.953719 2.259603 0.282162
C  -3.051299 0.806377 0.247761
C  -1.357045 -1.641294 0.101353
H  1.364078 1.161597 1.884146
H  3.348753 -0.130128 1.067293
H  -1.494477 2.860625 -0.472539
H  -1.131028 2.731419 1.267261
H  3.174135 1.268045 -1.567136
H  4.567263 0.815197 -0.655961
H  -3.458531 1.777275 0.577593
H  -3.424396 0.017032 0.930091
H  -3.367443 -0.331217 -1.342722
H  -0.966211 -3.528851 0.456087
