program: Gaussian 09
title: 000008316
version: EM64L-G09RevD.01
frameworkgroup: C1[X(C10H9NO4S)]
method: RPBEPBE
basis: SDD
operation: Freq
keyword: #p
keyword: freq=noraman
keyword: PBEPBE/SDD
title: #p freq=noraman PBEPBE/SDD
converged: YES YES NO NO
title: Mulliken charges:
elementType: S O O O O N C C C C C C C C C C H H H H H H H H H
charge: 0.964027 -0.470583 -0.563917 -0.516543 -0.508890 -0.664422 0.618604 0.359240 -0.411943 0.080297 -0.423892 0.156994 -0.407927 -0.376347 -0.249344 -0.265178 0.287759 0.285950 0.205210 0.235635 0.233719 0.357958 0.321117 0.376626 0.375853
chargesum: 0.00000
title: Mulliken charges with hydrogens summed into heavy atoms:
elementType: S O O O O N C C C C C C C C C C
charge: 0.964027 -0.093957 -0.188065 -0.516543 -0.508890 0.014653 0.618604 0.359240 -0.411943 0.080297 -0.136134 0.156994 -0.121977 -0.171137 -0.013709 -0.031459
polarizability: 2.20644038e+02 -5.67011284e-01 2.04694208e+02 -1.50702313e+00 2.93573393e-01 7.78207188e+01
1716.lowfreq: -12.2416 -0.0029 -0.0019 -0.0011 3.4359 7.9204 41.0090 70.8165 110.5986
frequency: 41.0039 70.8140 110.5984 121.2950 140.8087 172.9054 192.3167 222.5369 251.0717 263.1601 295.9142 301.9919 315.7080 325.7160 330.5515 370.0398 383.3024 407.4305 429.7141 438.7982 476.8603 512.2168 529.8361 561.1113 580.1445 603.6320 618.7759 706.4738 713.6192 737.3165 765.2223 820.3139 825.8149 871.8350 881.4114 902.0514 916.6592 952.5913 958.6367 993.4492 1037.9821 1041.4547 1080.5506 1108.5820 1165.2979 1181.0862 1189.8719 1246.8345 1282.0672 1321.0208 1376.5136 1402.8320 1430.6942 1458.1136 1484.8032 1528.6024 1583.9881 1601.6064 1630.8616 1633.6292 3123.6159 3127.2266 3143.0311 3160.0225 3173.9356 3473.0991 3555.8562 3616.7555 3706.7193
redmass: 8.7604 5.3054 4.3126 4.3566 7.5684 1.8767 6.3409 9.0027 2.6236 4.9147 4.6647 1.1430 8.3653 4.6715 4.9736 3.4056 1.5819 8.9084 2.7009 7.7470 5.9687 3.2805 10.8130 1.1376 5.0492 3.7617 5.8779 3.9752 5.5718 6.7977 1.4984 3.2474 2.5582 1.3964 5.8457 3.0859 3.9167 2.1675 2.9428 1.3659 1.9790 1.3077 2.1077 2.0975 1.6307 1.4503 1.1438 2.4148 1.6399 1.9130 5.8278 2.7771 3.9268 2.5012 4.9054 4.3134 5.2273 4.5285 2.4001 2.2510 1.0863 1.0919 1.0894 1.0948 1.0995 1.0660 1.0461 1.0666 1.1025
irintensity: 0.6715 0.3405 0.0883 5.2066 1.4579 43.3404 3.6442 4.1336 37.6745 4.2294 25.3827 142.0108 9.6999 0.9843 32.6784 44.0965 32.2097 69.7481 45.0095 20.7698 2.2642 17.5227 195.8387 153.4976 7.2659 1.0593 20.5517 32.3375 0.3635 8.1509 94.5387 55.9207 28.9808 24.1301 31.5098 40.9330 2.1621 38.6795 48.6316 0.1160 23.8498 94.3731 190.7774 94.3444 66.9869 13.2345 3.9161 10.0403 11.0119 69.0208 3.4920 88.5001 5.8481 8.8405 74.3075 57.1663 28.8647 28.3518 103.8079 294.6572 6.2796 10.5004 16.2752 12.9851 17.7732 36.0811 158.2373 76.1824 38.5214
temp: 298.150 k
press: 1.00000 atm
elementType: 16 8 8 8 8 7 6 6 6 6 6 6 6 6 6 6 1 1 1 1 1 1 1 1 1
symmnumber: 1
zpe: 460444.5 jmol-1
zpe.correction: 0.175374 hartree
zpe.thermalcorrener: 0.190590 hartree
zpe.thermalcorrenthalpy: 0.191534 hartree
zpe.thermalcorrgfe: 0.133695 hartree
zpe.sumelectzpe: -1138.856522 hartree
zpe.sumelectthermal: -1138.841306 hartree
zpe.sumelectthermalent: -1138.840362 hartree
zpe.sumelectthermalfe: -1138.898201 hartree
dipole: -6.1067 -0.5790 1.2787
dipole: 6.2660
quadrupole: -90.4530 -84.5971 -108.8670
quadrupole: 3.5152 7.3231 1.6920
quadrupole: 4.1860 10.0420 -14.2280 3.5152 7.3231 1.6920
hfenergy: -1139.0318959 hartree
pointgroup: C01 [X(C10H9N1O4S1)]
dipole: -2.4094512 0.2377088 -0.4641025 debye
dipolederiv: 2.4790733 0.0695969 -0.0879951 -0.1440952 1.1633479 0.0848529 -0.4108475 0.0622216 1.5771312 -0.2128204 0.4492397 0.0155938 0.3958972 -1.4764632 -0.0258296 -0.0138099 -0.0117188 -0.4139466 -0.6519644 -0.0220052 0.2403057 0.1071594 -0.5339994 -0.1417134 0.5401884 -0.0964889 -0.9539052 -0.7619577 -0.1225426 -0.0156223 -0.1924422 -0.6254878 -0.0719816 0.0004555 -0.0109895 -0.4731023 -0.7752563 0.0343654 -0.0414804 0.1293991 -0.5467141 0.1304243 -0.0050829 0.0430123 -0.5508533 -1.6672665 0.4939081 0.0046739 0.3575031 -0.2696265 0.0103117 -0.0162982 0.0145019 -0.6523872 -0.0318162 0.1412897 0.0032896 0.3860394 0.1639118 -0.0090206 0.010193 0.0007046 0.0664134 -0.2128823 -0.0028419 -0.0000358 0.3700764 0.039274 0.0057216 0.0247332 0.0009479 0.0102033 -0.687854 0.0030225 0.0008416 0.2850449 -0.2718023 0.0140209 -0.241634 0.0221299 -0.2073458 1.7538816 -0.6097265 0.0039983 -0.0937883 -0.0636314 -0.0099695 0.0290618 -0.0080773 0.1127135 0.3319628 0.0345794 0.0046723 -0.5746101 -0.1103242 -0.0028854 0.0561369 -0.0008927 -0.0813473 -0.6419847 -0.20558 -0.0058583 -0.7519806 1.3811402 0.027666 0.0142147 0.0095654 -0.0204286 0.0629283 -0.0558958 -0.0054663 -0.1013366 -0.0870705 0.0075358 0.0042525 -0.0220928 -0.1058241 -0.0018448 0.0312739 0.0068762 -0.0954495 -0.065281 0.0026279 -0.0052751 0.0052725 -0.1696236 0.0787035 -0.0672654 0.0030507 -0.1095508 0.0966825 0.000323 -0.0037434 0.0021364 -0.1486774 0.0256393 0.0593721 0.0086051 0.1660535 -0.0113859 0.0056345 0.0115987 0.0055866 -0.15293 0.1608751 -0.062856 -0.0082547 -0.0197309 0.045197 -0.002142 -0.0116283 -0.0025016 0.1617324 0.0345722 0.0548402 -0.0028254 -0.0077277 0.1152662 -0.0043564 0.0110454 0.0204948 0.1331667 -0.1296767 0.0108845 -0.0045385 0.0846948 0.0635378 -0.0001556 -0.0092172 -0.0027611 0.1552923 0.0685934 0.0644145 -0.001738 0.0483977 -0.0963385 -0.0029421 -0.0025074 -0.0026265 0.1579557 -0.0052568 -0.114606 -0.0046638 -0.1078264 -0.035421 -0.005458 -0.0038058 -0.0060761 0.1610913 0.256626 -0.0412605 -0.0036963 -0.13434 0.2502115 -0.002178 -0.0028146 -0.0020109 0.3816537 0.2881002 -0.0560752 -0.0038125 -0.0071526 0.1365657 -0.004575 0.0002179 -0.0055934 0.3621398 0.1369322 -0.1216358 -0.0061086 -0.0806075 0.4285305 0.0021042 -0.0019805 -0.0005604 0.395245 0.102693 0.035504 -0.0998112 0.0903729 0.3098807 -0.0080158 0.0265468 -0.014184 0.2556331 unknown
polarizability: 220.6583829|0.5740417|204.6376348|-0.5334136|2.681584|77.8629462 unknown
InChI: InChI=1S/C10H9NO4S/c11-10-7-4-2-1-3-6(7)9(5-8(10)12)16(13,14)15/h1-5,12-13H,11H2
charge 0 multiplicity 1
25 atoms
S  2.598211 0.303767 0.073574
O  -1.658835 3.319752 0.059216
O  2.80748 -0.192648 -1.718886
O  3.242763 1.774932 0.290466
O  3.15303 -0.93698 0.960192
N  -3.366411 1.296451 -0.015121
C  -0.117197 -0.669451 0.020519
C  -1.546538 -0.399465 -0.004256
C  0.753147 0.465787 0.061552
C  -2.026901 0.965651 0.006835
C  0.295529 1.787806 0.061934
C  -1.088593 2.027989 0.045228
C  0.33287 -2.03152 0.007886
C  -2.451325 -1.509676 -0.044102
C  -0.581541 -3.084536 -0.033121
C  -1.985416 -2.825033 -0.059774
H  1.021457 2.609958 0.087896
H  1.405541 -2.239172 0.046784
H  -3.533832 -1.34007 -0.063669
H  -0.220301 -4.118132 -0.041895
H  -2.694714 -3.658587 -0.090927
H  -3.618166 2.283059 -0.003914
H  -4.098551 0.595287 -0.038687
H  -0.967519 4.024097 0.078532
H  3.767913 -0.454066 -1.833561
