program: Gaussian 09
title: 000085934
version: EM64L-G09RevD.01
frameworkgroup: C1[X(C13H20N2O6)]
method: RPBEPBE
basis: SDD
operation: Freq
keyword: #p
keyword: freq=noraman
keyword: PBEPBE/SDD
title: #p freq=noraman PBEPBE/SDD
converged: YES YES NO NO
title: Mulliken charges:
elementType: O O O O O O N N C C C C C C C C C C C C C H H H H H H H H H H H H H H H H H H H H
charge: -0.255579 -0.282878 -0.443487 -0.295731 -0.244430 -0.232884 -0.167251 -0.399802 -0.351982 -0.376466 -0.389441 0.251531 -0.266042 -0.076647 -0.376232 -0.304714 -0.679194 0.269344 0.277474 -0.272544 -0.276602 0.226748 0.230439 0.229983 0.226292 0.214859 0.268820 0.322896 0.234819 0.244507 0.213729 0.195020 0.217931 0.232242 0.257209 0.238345 0.205245 0.215135 0.343108 0.294878 0.281353
chargesum: 0.00000
title: Mulliken charges with hydrogens summed into heavy atoms:
elementType: O O O O O O N N C C C C C C C C C C C C C
charge: -0.255579 -0.282878 -0.100379 -0.295731 -0.244430 -0.232884 -0.167251 -0.076906 0.105205 0.079809 0.094239 0.251531 0.213284 0.137082 0.036718 0.184737 -0.020469 0.269344 0.277474 0.022334 0.004751
polarizability: 2.41781725e+02 -8.66667972e+00 1.66382180e+02 9.89473018e-01 7.65394091e+00 1.40871315e+02
1716.lowfreq: -6.1003 -2.1606 0.0002 0.0003 0.0008 3.1275 11.2609 18.6924 23.2648
frequency: 10.1194 18.6779 22.9321 30.5454 35.4467 42.6336 51.6043 75.4347 87.9760 111.2104 119.5943 142.3408 170.0202 171.3540 188.4421 204.5799 209.9218 223.6676 234.9794 248.9042 253.4839 278.2979 296.9110 334.5857 363.6213 388.8351 422.1829 451.5800 456.1040 501.2690 534.0177 594.2460 607.0403 612.9836 657.0240 690.0849 704.9223 723.6752 746.6584 750.3798 759.7211 804.9493 818.3036 878.0936 885.0680 890.4896 918.7150 935.0088 944.1273 955.5028 967.7052 983.7834 1005.1316 1011.3852 1026.0694 1027.4114 1054.5781 1076.3705 1099.9619 1105.5392 1124.7646 1127.6310 1130.3674 1137.0912 1181.4326 1197.8766 1213.8147 1223.2708 1230.8627 1242.9794 1271.0190 1279.5119 1287.5435 1289.6284 1297.8435 1306.3812 1309.2536 1349.0328 1355.6150 1360.2057 1370.0523 1375.7852 1390.1456 1393.8123 1418.1316 1451.2296 1452.2574 1461.1279 1469.3891 1473.7869 1488.0039 1497.0572 1502.2549 1610.1412 1620.8810 1659.9321 1681.3329 2948.1315 2960.7076 2963.7423 2977.3511 2982.6178 3005.2039 3014.7277 3024.9052 3032.6620 3044.0831 3053.6582 3056.5093 3071.4810 3076.2093 3087.8339 3092.0775 3159.4129 3164.7968 3542.1779 3621.9099
redmass: 5.4756 5.0760 5.9241 6.0525 5.2266 5.0757 4.9769 3.2618 6.4341 3.2486 4.2107 2.4274 2.9357 4.7398 3.9665 1.6893 3.1422 2.6677 4.1246 3.7481 3.7065 5.7809 2.8200 3.2722 2.3569 1.1446 3.6402 2.5032 1.1295 3.9250 3.6256 4.9368 3.9649 3.9971 6.3558 4.8578 9.7873 10.4194 3.2400 4.2807 1.8114 2.1697 2.9295 2.4989 1.4819 2.7942 2.1307 2.7258 4.7811 2.4964 3.4390 1.6370 2.4412 1.0872 2.0265 2.8122 2.2314 2.3544 1.8150 1.6310 2.2431 1.9435 3.6303 2.6266 1.2478 1.1734 1.3362 1.3994 1.2206 1.6376 1.6615 1.5765 2.0700 2.1977 1.2981 1.3197 1.3857 1.5289 1.4111 1.4468 1.4005 1.2350 1.2063 1.5787 2.2763 1.0813 1.0810 1.0770 1.0789 1.0418 1.0579 1.1243 1.0887 11.0987 10.8897 6.6703 8.3788 1.0676 1.0671 1.0670 1.0567 1.0406 1.0589 1.0599 1.0900 1.0950 1.0919 1.0967 1.0989 1.1039 1.0993 1.1077 1.1004 1.0972 1.0886 1.0655 1.0795
irintensity: 0.9158 1.4634 0.6267 4.2804 1.1789 3.0546 2.8067 0.4946 3.2205 1.0807 1.7084 1.3148 3.4760 3.2148 2.2019 6.1190 16.6762 0.7666 6.4576 15.4937 4.5591 3.1104 2.8135 16.8773 1.7576 143.6942 23.7069 71.1949 129.0625 8.2270 14.4070 14.5316 2.4530 3.0481 7.4290 11.7008 27.3147 16.5176 2.8254 0.9008 1.8710 20.1218 5.4640 22.4941 5.9475 0.3367 0.1484 26.5530 162.1161 8.2555 4.3732 38.5567 51.7917 56.0182 20.6279 46.9416 30.8625 49.0078 44.1530 4.0093 259.6085 184.2134 78.8733 62.8131 8.4663 6.6023 22.5686 34.8935 2.1088 134.6732 384.0595 198.3860 37.7449 57.3570 31.2710 4.7265 8.1858 8.1086 4.4874 15.3321 4.6650 27.7605 14.3511 5.9215 113.4964 25.5361 14.6072 4.0531 15.0802 11.1883 13.6813 23.4417 4.2021 208.2855 82.5450 0.1462 402.6555 60.4855 82.6474 55.2212 44.6564 25.0671 26.6718 5.8343 4.5042 51.0846 40.7432 2.9990 45.8332 24.5103 58.9382 9.9024 38.3479 0.0569 1.1665 6.3018 47.4361
temp: 298.150 k
press: 1.00000 atm
elementType: 8 8 8 8 8 8 7 7 6 6 6 6 6 6 6 6 6 6 6 6 6 1 1 1 1 1 1 1 1 1 1 1 1 1 1 1 1 1 1 1 1
symmnumber: 1
zpe: 861477.8 jmol-1
zpe.correction: 0.328120 hartree
zpe.thermalcorrener: 0.351182 hartree
zpe.thermalcorrenthalpy: 0.352126 hartree
zpe.thermalcorrgfe: 0.270134 hartree
zpe.sumelectzpe: -1066.593242 hartree
zpe.sumelectthermal: -1066.570180 hartree
zpe.sumelectthermalent: -1066.569236 hartree
zpe.sumelectthermalfe: -1066.651228 hartree
dipole: -2.3290 1.1862 2.9743
dipole: 3.9595
quadrupole: -106.7595 -123.1964 -131.2940
quadrupole: -4.1771 -33.8245 -8.2215
quadrupole: 13.6572 -2.7798 -10.8774 -4.1771 -33.8245 -8.2215
hfenergy: -1066.9213619 hartree
pointgroup: C01 [X(C13H20N2O6)]
dipole: -0.9501595 0.4339551 1.155695 debye
polarizability: 241.8486733|-8.1203059|165.8984927|3.2720465|7.9627261|141.2880533 unknown
InChI: InChI=1S/C13H20N2O6/c1-2-10(16)9-21-12(18)4-3-11(17)20-8-7-15-6-5-14-13(15)19/h3-4,10,14,16H,2,5-9H2,1H3
charge 0 multiplicity 1
41 atoms
O  -2.137201 1.015305 -0.367816
O  -4.760329 -1.12572 -2.070014
O  6.056783 -0.262571 1.829207
O  3.647845 -0.355049 0.271486
O  -0.590486 2.459135 0.626861
O  2.111271 -1.83658 -0.681324
N  -4.966513 0.250381 -0.13121
N  -5.262691 -1.96741 0.105507
C  -5.087106 0.041277 1.322174
C  -5.65672 -1.410545 1.409745
C  -4.498349 1.482122 -0.752751
C  -4.970211 -0.971822 -0.836017
C  -3.196054 2.040209 -0.16631
C  6.048888 -0.654792 0.407065
C  6.364611 0.539969 -0.521553
C  4.73339 -1.362482 0.063578
C  7.751493 1.150404 -0.235704
C  -0.859074 1.362322 0.075489
C  2.365716 -0.73038 -0.148341
C  0.09058 0.256246 -0.206629
C  1.404755 0.365497 0.130576
H  -5.765474 0.77705 1.790827
H  -4.098051 0.106079 1.822836
H  -5.215001 -1.969229 2.252502
H  -6.75912 -1.395275 1.53389
H  -5.264694 2.281346 -0.66794
H  -4.363133 1.252391 -1.825429
H  -5.48223 -2.911719 -0.201726
H  -3.268499 2.262663 0.914737
H  -2.902365 2.971238 -0.685017
H  6.861811 -1.401783 0.336354
H  6.313723 0.195306 -1.574436
H  5.573919 1.30617 -0.401529
H  4.699599 -1.717187 -0.98223
H  4.545073 -2.211199 0.744229
H  7.836511 1.430985 0.82864
H  8.559096 0.427603 -0.458016
H  7.924957 2.051678 -0.850709
H  5.273792 0.32871 1.978923
H  -0.30018 -0.64214 -0.696286
H  1.784967 1.271296 0.614963
