program: Gaussian 09
title: 000085855
version: EM64L-G09RevD.01
frameworkgroup: C1[X(C10H18O2)]
method: RPBEPBE
basis: SDD
operation: Freq
keyword: #pfreq=noraman
keyword: PBEPBE/SDD
title: #p freq=noraman PBEPBE/SDD
converged: YES YES NO NO
title: Mulliken charges:
elementType: O O C C C C C C C C C C H H H H H H H H H H H H H H H H H H
charge: -0.416446 -0.234067 -0.360771 -0.353362 -0.376946 -0.354787 -0.458456 -0.695421 -0.170973 -0.179419 -0.556116 0.204488 0.186575 0.192443 0.186840 0.189449 0.209724 0.192865 0.195571 0.194667 0.210918 0.200019 0.215697 0.209985 0.209571 0.222199 0.252181 0.251828 0.256679 0.375063
chargesum: 0.00000
title: Mulliken charges with hydrogens summed into heavy atoms:
elementType: O O C C C C C C C C C C
charge: -0.041383 -0.234067 0.018247 0.022927 0.025643 0.035452 -0.047520 -0.060168 0.051226 0.072762 -0.047608 0.204488
polarizability: 1.64358559e+02 3.32623084e-01 1.00829358e+02 5.48402563e+00 -3.23430586e+00 8.78521462e+01
1716.lowfreq: -12.2116 -0.0010 -0.0006 -0.0004 1.7334 13.8655 21.5720 31.5421 37.6493
frequency: 20.2551 29.5933 37.3782 47.8451 71.4791 85.5966 113.8542 123.2218 139.6279 214.6806 231.8794 238.7528 268.4519 307.1622 375.4324 419.9837 476.5408 494.8276 533.7635 599.0036 647.7072 720.5757 732.7962 756.7944 795.3118 860.9222 877.4545 889.4221 933.7301 966.5049 978.3306 1002.1722 1013.0891 1028.4250 1047.9634 1065.4343 1078.2008 1102.4372 1115.3083 1140.3452 1178.3600 1194.5618 1223.2592 1236.2040 1242.0963 1268.7537 1273.3066 1285.0694 1290.1714 1297.0854 1298.3090 1322.5551 1345.8865 1353.8121 1362.3530 1390.5752 1430.0443 1455.5911 1461.9925 1464.8683 1473.2476 1478.5278 1481.6556 1488.2710 1671.2811 1692.1013 2950.6487 2952.9023 2954.7171 2957.0907 2964.4823 2969.0325 2971.8769 2987.2827 3000.5044 3013.4459 3028.3364 3043.2245 3061.3725 3064.8503 3068.5747 3070.7441 3114.1766 3510.8896
redmass: 4.4749 4.7368 3.1207 2.4745 2.2810 4.1234 2.4471 2.1306 2.2321 2.5901 3.1610 1.1487 2.1825 4.0718 4.0710 2.9170 3.4228 2.2071 2.6832 3.6441 1.4266 1.0646 1.1257 1.4263 1.3092 3.9360 1.2994 1.9017 2.3884 1.3356 1.1034 2.8545 3.3664 2.2920 1.9728 2.3435 2.2102 2.4967 2.3399 1.7617 1.4167 1.5530 1.2719 1.3635 1.4095 1.3052 1.1546 1.1042 1.1511 1.3412 1.1945 1.4696 1.5264 1.6722 1.7750 1.2178 1.0875 1.0847 1.0692 1.0774 1.0776 1.0426 1.0800 1.0870 8.5170 6.6258 1.0596 1.0613 1.0591 1.0677 1.0602 1.0597 1.0364 1.0968 1.0988 1.0993 1.1028 1.1031 1.0908 1.0923 1.1006 1.0993 1.0902 1.0639
irintensity: 0.0743 0.6381 0.3282 0.3510 0.2054 0.4233 0.6392 0.0982 0.0282 1.4087 0.4290 0.0385 2.6462 0.5226 9.7925 2.6922 6.9527 20.5567 14.4742 30.3552 132.1818 12.1586 1.1199 1.3696 6.2413 1.8061 3.0481 5.5031 3.7872 14.7328 61.0604 2.4273 23.4574 183.0696 70.9507 6.9306 0.1894 25.2864 3.4123 28.2043 4.1642 0.3955 4.3837 0.1506 1.5265 1.3268 0.1588 0.9769 0.4628 11.0149 0.3788 12.7901 3.0967 0.2403 44.0571 10.9537 35.1878 2.9825 0.1190 1.1754 1.5560 12.3103 4.6372 22.6091 214.3238 1.8051 0.7086 16.6239 4.8856 15.1499 2.4291 157.1157 39.5005 1.7064 2.0572 2.1990 8.2596 105.4179 0.4144 43.1102 101.4057 55.9289 17.2974 18.9578
temp: 298.150 k
press: 1.00000 atm
elementType: 8 8 6 6 6 6 6 6 6 6 6 6 1 1 1 1 1 1 1 1 1 1 1 1 1 1 1 1 1 1
symmnumber: 1
zpe: 681430.9 jmol-1
zpe.correction: 0.259543 hartree
zpe.thermalcorrener: 0.274674 hartree
zpe.thermalcorrenthalpy: 0.275618 hartree
zpe.thermalcorrgfe: 0.214056 hartree
zpe.sumelectzpe: -541.329314 hartree
zpe.sumelectthermal: -541.314184 hartree
zpe.sumelectthermalent: -541.313240 hartree
zpe.sumelectthermalfe: -541.374802 hartree
dipole: 0.6067 -1.4513 0.2114
dipole: 1.5872
quadrupole: -70.3031 -79.4299 -73.7161
quadrupole: 6.2603 -0.2108 0.1335
quadrupole: 4.1799 -4.9468 0.7669 6.2603 -0.2108 0.1335
hfenergy: -541.5888578 hartree
pointgroup: C01 [X(C10H18O2)]
dipole: 0.2378725 0.5112517 -0.2682617 debye
polarizability: 164.3047284|-2.2171493|97.3997643|-5.4197871|-6.5598296|91.3355704 unknown
InChI: InChI=1S/C10H18O2/c1-2-3-4-5-6-7-8-9-10(11)12/h7-8,11H,2-6,9H2,1H3
charge 0 multiplicity 1
30 atoms
O  -5.683207 0.644597 -0.35474
O  -4.705208 -1.092157 0.83685
C  2.880343 -0.529419 -0.075125
C  4.12673 0.37918 0.01792
C  1.558668 0.259349 -0.211453
C  5.448897 -0.409867 0.157555
C  0.315972 -0.664059 -0.32665
C  6.690852 0.503839 0.238884
C  -0.973406 0.103305 -0.524483
C  -2.055639 0.033798 0.291495
C  -3.324215 0.834414 0.087229
C  -4.586568 0.001026 0.244832
H  2.989304 -1.213346 -0.943266
H  2.829959 -1.176966 0.825147
H  4.179875 1.023614 -0.88466
H  4.018497 1.066163 0.883366
H  1.43241 0.931688 0.660865
H  1.612081 0.914031 -1.10624
H  5.397552 -1.048563 1.063005
H  5.552695 -1.101048 -0.703949
H  0.239708 -1.301013 0.576126
H  0.472575 -1.349192 -1.187329
H  7.621518 -0.084369 0.340348
H  6.625534 1.185496 1.108071
H  6.783056 1.128508 -0.669739
H  -1.007385 0.768681 -1.403581
H  -2.044138 -0.635012 1.163117
H  -3.398908 1.64678 0.843058
H  -3.344587 1.332801 -0.897396
H  -6.501463 0.095042 -0.211158
