program: Gaussian 09
title: 000008302
version: EM64L-G09RevD.01
frameworkgroup: C1[X(C3F6)]
method: RPBEPBE
basis: SDD
operation: Freq
keyword: #p
keyword: freq=noraman
keyword: PBEPBE/SDD
title: #p freq=noraman PBEPBE/SDD
converged: NO NO NO YES
title: Mulliken charges:
elementType: F F F F F F C C C
charge: -0.133792 -0.149385 -0.149381 -0.136126 -0.125920 -0.120566 0.362819 0.100626 0.351726
chargesum: 0.00000
title: Mulliken charges with hydrogens summed into heavy atoms:
polarizability: 4.58307342e+01 -4.50048603e+00 3.86888441e+01 4.22864951e-04 -2.72232894e-03 2.35712980e+01
1716.lowfreq: -17.9594 -8.4542 -0.0004 0.0009 0.0014 7.5613 12.3114 123.9903 132.4758
frequency: -15.1444 123.9894 132.4754 227.0249 263.0753 321.2185 343.9071 384.2744 438.8174 495.4107 533.4825 585.3967 612.3111 674.3404 932.9513 1007.5952 1042.9197 1117.8019 1212.0618 1283.7016 1739.5207
redmass: 18.8319 18.3541 18.1938 17.7768 18.3929 18.6850 17.9676 15.3101 17.7481 14.8122 17.6225 16.9684 13.0937 18.2320 14.3531 13.0446 13.2313 13.4641 13.2358 12.3643 12.1167
irintensity: 0.1035 0.6093 2.3239 1.9844 2.5218 0.5109 2.6113 3.8467 3.5639 0.3129 0.0258 17.0306 1.3154 5.0285 199.7789 278.2372 188.6604 60.2285 196.4074 175.5395 145.5956
temp: 298.150 k
press: 1.00000 atm
elementType: 9 9 9 9 9 9 6 6 6
symmnumber: 1
zpe: 80582.1 jmol-1
zpe.correction: 0.030692 hartree
zpe.thermalcorrener: 0.038278 hartree
zpe.thermalcorrenthalpy: 0.039222 hartree
zpe.thermalcorrgfe: -0.002049 hartree
zpe.sumelectzpe: -712.624272 hartree
zpe.sumelectthermal: -712.616687 hartree
zpe.sumelectthermalent: -712.615742 hartree
zpe.sumelectthermalfe: -712.657013 hartree
dipole: 1.1750 0.0757 -0.0001
dipole: 1.1774
quadrupole: -50.3420 -51.0863 -47.0126
quadrupole: -0.5304 0.0002 0.0007
quadrupole: -0.8617 -1.6060 2.4677 -0.5304 0.0002 0.0007
hfenergy: -712.6549645 hartree
pointgroup: C01 [X(C3F6)]
dipole: 0.4629094 -0.0171032 0.0000328 debye
dipolederiv: -0.5824488 -0.3089657 0.0001656 -0.1862669 -0.5541949 0.0001591 0.0000822 0.0001666 -0.2746496 -0.4359142 0.0593092 0.0803427 0.1828847 -0.4243428 -0.2529532 0.0879015 -0.2089131 -0.6366164 -0.4360352 0.0592526 -0.0804806 0.1828913 -0.4239295 0.2527876 -0.088174 0.2087255 -0.6370422 -0.1852921 0.0750985 -0.0000122 -0.1765487 -0.7268549 0.0001002 0.0000153 0.0000835 -0.0781746 -0.9637718 0.1186946 -0.0000342 0.2571096 -0.2893918 0.0000483 -0.0000396 0.0000401 -0.0638965 -0.2636998 -0.032993 0.0000024 -0.2072166 -0.8572203 0.0001449 0.000042 0.0001614 -0.0790203 1.7967711 0.2146344 -0.0000124 -0.2528591 1.3655135 0.0000336 0.0001564 0.0000267 1.6675746 -0.4201502 -0.115512 0.0000061 0.0873055 0.6639786 -0.0001213 0.0000565 -0.0000904 -0.1514843 1.4905409 -0.0695186 0.0000226 0.1127002 1.2464421 -0.0001992 -0.0000404 -0.0002003 0.2533093 unknown
polarizability: 45.5784689|4.6896042|38.9411094|-0.000348|-0.0027329|23.571298 unknown
InChI: InChI=1S/C3F6/c4-1(2(5)6)3(7,8)9
charge 0 multiplicity 1
9 atoms
F  -2.11522 -0.922187 0.000519
F  -1.36388 0.902477 1.130378
F  -1.364127 0.901428 -1.131162
F  0.315507 -1.90785 0.000316
F  2.637726 -0.327564 0.000083
F  1.401476 1.580258 -0.000284
C  -1.139918 0.08225 -0.00004
C  0.24546 -0.519913 0.000105
C  1.382976 0.2110 -0.000015
