program: Gaussian 09
title: 000085820
version: EM64L-G09RevD.01
frameworkgroup: C1[X(C12H14)]
method: RPBEPBE
basis: SDD
operation: Freq
keyword: #p
keyword: freq=noraman
keyword: PBEPBE/SDD
title: #p freq=noraman PBEPBE/SDD
converged: YES YES NO NO
title: Mulliken charges:
elementType: C C C C C C C C C C C C H H H H H H H H H H H H H H
charge: -0.247515 -0.444756 -0.425945 -0.436915 -0.244011 0.467268 -0.190455 -0.435543 -0.382866 -0.226052 -0.237755 -0.246631 0.205749 0.217439 0.203127 0.225282 0.205800 0.212045 0.211653 0.222498 0.199556 0.229969 0.247153 0.222631 0.222240 0.226036
chargesum: 0.00000
title: Mulliken charges with hydrogens summed into heavy atoms:
elementType: C C C C C C C C C C C C
charge: -0.041766 -0.024191 0.005137 -0.013217 -0.021514 0.467268 0.009101 -0.205574 -0.135713 -0.003421 -0.015515 -0.020595
polarizability: 1.59975467e+02 6.36728726e+00 1.15594252e+02 -2.25505976e+00 6.58902515e+00 8.56025659e+01
1716.lowfreq: -18.7995 -6.1114 -0.0007 -0.0004 -0.0003 17.3902 46.9021 67.4561 108.3987
frequency: 46.4671 67.4376 108.1813 195.8286 235.6652 279.3969 341.3268 396.0796 406.2740 442.6587 506.2857 535.5129 596.8710 616.6760 701.4633 707.6710 727.2273 763.8358 786.8854 829.1918 856.7793 878.2795 891.3233 920.4096 930.3855 978.5368 985.0758 987.5079 990.2370 995.7617 1025.9305 1042.7302 1074.7518 1080.5695 1093.3524 1134.8593 1141.2605 1170.7026 1186.8839 1196.5420 1234.1835 1244.6282 1267.5214 1294.3245 1328.2244 1331.3217 1336.5667 1347.7708 1382.0374 1385.1448 1438.3262 1453.8544 1464.4891 1469.9283 1480.2723 1590.1565 1610.6512 1668.6899 2950.5458 2954.9130 2981.0593 2983.5527 3005.2997 3039.8363 3047.2430 3086.2680 3107.6889 3118.7295 3119.4581 3132.0035 3142.1577 3159.3555
redmass: 3.5543 3.4220 3.2818 2.8240 2.4988 3.2733 2.3817 3.2404 2.8540 2.4146 3.7165 3.3114 2.6699 6.3259 2.5721 1.8071 1.6110 1.9140 2.0944 3.3998 1.2510 1.5761 2.4285 1.8007 1.8333 1.4189 1.8071 1.6279 5.4594 1.3798 2.2649 1.7226 1.7088 1.6843 1.9965 1.1247 1.1854 1.0546 1.1109 1.9002 1.2470 1.2473 1.5166 1.5786 1.3030 1.3431 1.4911 1.5178 7.0332 1.5741 2.1904 1.0914 1.1023 1.0939 2.1644 6.0785 6.0825 6.7137 1.0638 1.0798 1.0634 1.0666 1.0911 1.0991 1.1041 1.0837 1.0872 1.0982 1.0861 1.0912 1.0955 1.1014
irintensity: 0.0127 0.1542 0.4758 0.2337 1.2685 0.2840 1.4450 0.2975 0.0769 3.3643 5.1598 9.1174 6.1672 0.1989 18.0374 48.1250 16.9957 48.1961 14.2265 0.6913 0.2556 14.9517 11.0600 7.0861 2.1291 0.2060 4.8027 1.8903 0.6065 0.7789 9.4805 1.1488 3.5029 7.0580 0.7190 0.9691 2.4242 0.0895 0.9804 1.6980 0.6383 0.7790 0.3758 13.3324 1.5317 0.1258 2.0611 1.8899 0.9435 0.3055 8.8812 8.7455 5.9698 11.5495 22.9208 0.9332 10.1627 3.1634 45.9584 17.3604 48.8222 21.0272 40.2192 39.5821 70.4156 9.2587 9.9995 48.9529 2.2632 15.5739 39.9821 27.8438
temp: 298.150 k
press: 1.00000 atm
elementType: 6 6 6 6 6 6 6 6 6 6 6 6 1 1 1 1 1 1 1 1 1 1 1 1 1 1
symmnumber: 1
zpe: 586224.1 jmol-1
zpe.correction: 0.223281 hartree
zpe.thermalcorrener: 0.233405 hartree
zpe.thermalcorrenthalpy: 0.234349 hartree
zpe.thermalcorrgfe: 0.187115 hartree
zpe.sumelectzpe: -464.784930 hartree
zpe.sumelectthermal: -464.774806 hartree
zpe.sumelectthermalent: -464.773862 hartree
zpe.sumelectthermalfe: -464.821096 hartree
dipole: -0.4994 0.2046 -0.3111
dipole: 0.6229
quadrupole: -67.1123 -67.4960 -74.2965
quadrupole: 1.2725 -0.1145 1.3771
quadrupole: 2.5226 2.1389 -4.6615 1.2725 -0.1145 1.3771
hfenergy: -465.0082109 hartree
pointgroup: C01 [X(C12H14)]
dipole: -0.1970804 0.0962164 -0.1093817 debye
dipolederiv: 0.0226338 -0.0260853 -0.0189879 0.0469735 0.0736957 0.0937969 -0.179307 0.0707918 0.138272 0.0366438 -0.0434681 -0.0281148 -0.0659688 0.0948197 0.0074146 0.0758427 -0.0270062 0.0601713 0.069673 -0.0228323 -0.012303 -0.0391625 0.0530184 -0.0268681 -0.0354481 -0.0366424 0.0536926 0.0510629 -0.064409 -0.0907438 -0.0476193 0.0977247 0.101727 -0.0300423 0.0957018 0.0203877 -0.0501456 0.1345267 0.0359402 0.2830398 -0.0240327 -0.151559 0.0278848 -0.1218639 -0.0299095 0.3407414 -0.0852878 -0.032774 -0.1939861 -0.0606905 0.0164464 -0.0346815 0.0508286 -0.0573102 -0.0325607 0.1053576 0.1402667 0.0281212 -0.0407296 -0.1625334 0.1688551 -0.1272256 0.0800404 -0.185157 0.0148812 -0.0173796 0.0121108 0.0692236 0.0972074 0.0146462 0.0823838 -0.1307763 -0.1361154 0.0764294 0.0025293 0.133839 -0.0550636 0.0191953 0.0403652 0.0168453 -0.1280131 0.0344768 0.0712551 -0.0107145 0.1009403 0.0292068 0.0508662 -0.0111515 0.0543975 -0.1218598 -0.0072762 -0.0027858 -0.0321709 -0.0350986 0.0981978 0.09556 -0.0438355 0.0976514 -0.1058511 0.0194442 -0.0333305 -0.0710992 -0.0472371 -0.0940105 0.0439818 -0.0602989 0.0390599 -0.1439394 -0.0063156 -0.0463325 -0.0447592 -0.0519516 -0.0474299 -0.1149766 0.0113085 -0.0801216 -0.0774733 -0.0132666 -0.1401462 0.0550485 -0.1217839 -0.0427544 0.0624262 0.0612887 0.0616392 0.0064066 -0.135529 0.1512177 0.0472275 0.1167438 -0.0183431 -0.0551775 0.0173039 -0.0678219 -0.0006323 -0.0342446 0.0556399 0.1022389 0.0709078 -0.0301936 -0.0764374 0.0998079 -0.0400917 0.0428102 -0.0071184 0.0420228 -0.1015417 0.039624 0.0058802 0.123142 -0.1056701 0.1082028 -0.1129517 0.0595923 -0.0541564 -0.022862 -0.0990544 -0.0804168 -0.1030678 -0.0963342 -0.0935877 -0.0407168 -0.1290287 0.0740181 0.0211039 0.1756813 0.0207544 0.0321659 0.0087022 -0.0040351 0.0265718 0.0842032 -0.0043445 -0.0851669 -0.0435345 0.0309031 0.117542 -0.0627779 0.1092648 -0.0771784 0.022696 -0.1150029 0.0307088 -0.1497126 -0.0312601 0.1236861 0.0127253 0.1100746 0.0113765 0.0899562 0.0573047 0.0438232 0.0287887 -0.0731028 -0.0902466 0.0322675 -0.095684 0.0910798 0.0215068 -0.102998 -0.0079471 -0.1177224 0.0306433 -0.0280285 -0.0312491 -0.0246141 0.1178429 -0.0633906 -0.1121613 -0.0024807 -0.1230784 -0.0006602 -0.0373692 -0.0027018 -0.0387409 0.1401129 0.0646692 0.0244453 0.0253419 0.0504609 -0.0890605 -0.0984154 0.0435553 -0.0983806 0.1082952 -0.1171514 0.0462419 0.0748166 0.0486789 0.0836803 -0.0404783 0.0789447 -0.0410261 0.129552 unknown
polarizability: 159.9097708|6.8527508|113.1907013|-1.4838145|10.5315858|88.0718133 unknown
InChI: InChI=1S/C12H14/c1-3-7-11(8-4-1)12-9-5-2-6-10-12/h1,3-5,7-9,12H,2,6,10H2
charge 0 multiplicity 1
26 atoms
C  -0.755532 0.667776 0.799215
C  -1.493253 1.443526 -0.340109
C  -2.129671 0.478828 -1.364804
C  -3.195641 -0.413102 -0.684155
C  -1.609103 -0.490511 1.296428
C  0.657963 0.236145 0.372223
C  -2.70961 -0.957529 0.648161
C  1.735468 1.153359 0.492328
C  0.921651 -1.041948 -0.18328
C  3.03658 0.809743 0.064651
C  2.223094 -1.391145 -0.61235
C  3.285633 -0.466839 -0.492765
H  -0.626453 1.376383 1.644952
H  -0.785614 2.131973 -0.839217
H  -2.292202 2.063483 0.11431
H  -1.338112 -0.158522 -1.804437
H  -2.584702 1.04912 -2.196868
H  -3.474933 -1.254847 -1.349713
H  -4.131105 0.165884 -0.525386
H  -1.296818 -0.957025 2.241539
H  -3.291784 -1.77467 1.098483
H  1.55144 2.1439 0.929091
H  0.103219 -1.766749 -0.263236
H  3.854907 1.531685 0.169274
H  2.407591 -2.385053 -1.036765
H  4.295088 -0.738268 -0.822168
