program: Gaussian 09
title: 000085824
version: EM64L-G09RevD.01
frameworkgroup: C1[X(C10H16O)]
method: RPBEPBE
basis: SDD
operation: Freq
keyword: #pfreq=noraman
keyword: PBEPBE/SDD
title: #p freq=noraman PBEPBE/SDD
converged: YES YES NO NO
title: Mulliken charges:
elementType: O C C C C C C C C C C H H H H H H H H H H H H H H H H
charge: -0.203374 -0.161174 -0.480996 0.368445 -0.514950 -0.030242 -0.391519 -0.356477 -0.721133 -0.345593 -0.696501 0.248557 0.233958 0.230262 0.204700 0.223799 0.253253 0.228865 0.194489 0.217622 0.249144 0.216783 0.191619 0.201344 0.215564 0.208190 0.215363
chargesum: 0.00000
title: Mulliken charges with hydrogens summed into heavy atoms:
elementType: O C C C C C C C C C C
charge: -0.203374 0.087383 -0.016775 0.368445 -0.086451 -0.030242 -0.138266 0.066877 -0.037584 0.047370 -0.057383
polarizability: 1.32612866e+02 7.56974037e+00 1.10870136e+02 5.63598994e+00 1.84253733e+00 8.26078996e+01
1716.lowfreq: -34.0502 -11.1081 -9.3498 -0.0008 -0.0006 -0.0006 26.2406 43.8037 58.1211
frequency: 7.7410 43.6335 57.8141 86.1722 104.4687 208.1823 214.1445 225.5120 230.6689 244.0642 277.8161 321.1630 383.1417 469.7384 516.5316 576.4859 677.8291 703.7412 730.5783 764.9612 788.6930 819.9874 879.8800 895.3760 909.2731 931.1379 953.3742 1001.6890 1013.6852 1045.7066 1069.7345 1083.0002 1103.5601 1108.8012 1118.8876 1171.0526 1202.9558 1212.0643 1244.0185 1258.7942 1272.1035 1279.7898 1289.1815 1296.7862 1320.5199 1340.8846 1347.1963 1385.4421 1385.5008 1454.3563 1455.4912 1465.8541 1473.1474 1474.7722 1476.2025 1480.3678 1485.9884 1615.3996 1641.5863 2962.4565 2970.4976 2972.4428 2977.8671 2980.2263 2982.0809 2989.9481 3006.8400 3025.1996 3026.1331 3052.4782 3069.7898 3072.0770 3078.1684 3089.8739 3139.5495
redmass: 2.4202 3.7059 2.0708 3.0743 2.2896 2.2354 1.6033 1.1798 1.6847 2.7679 3.2339 3.1228 2.2917 3.1825 3.6739 4.5603 4.3902 5.0121 1.1162 2.5146 1.4127 1.2730 2.1509 1.8057 1.5802 1.3619 1.9391 2.4882 2.0584 1.8901 2.5607 1.7122 1.8561 2.0586 1.8434 1.4859 1.4711 1.5126 1.4239 1.4701 1.3314 1.4718 1.0732 1.8230 1.4058 2.3956 1.5592 1.1998 1.2125 1.0993 1.0988 1.0661 1.0459 1.0656 1.0507 1.0533 1.0776 10.8095 7.4800 1.0585 1.0567 1.0397 1.0591 1.0602 1.0374 1.0837 1.0971 1.0993 1.1013 1.1040 1.1008 1.0997 1.1004 1.1000 1.0958
irintensity: 1.1983 2.3806 0.5460 0.0757 0.3833 0.6328 0.6972 1.0015 1.0543 2.5298 4.7483 1.1526 1.0594 4.6745 1.8615 3.9013 2.0386 2.2002 9.1663 3.4483 4.7002 13.9579 3.6836 0.9896 2.9345 4.4037 30.6822 14.2275 12.1786 10.8753 1.7228 9.2305 20.6032 4.1928 1.6128 0.7632 0.4035 5.0485 4.8684 4.9300 7.5119 0.1409 2.7333 10.1869 2.1407 23.8460 0.6000 17.9876 10.1011 13.9127 7.1055 0.1557 13.4253 6.0134 11.4955 6.3993 16.0356 174.1834 7.9955 23.8248 2.9650 35.7070 20.8194 73.1229 42.6345 3.8982 8.8545 21.2732 0.5619 20.6578 85.0171 60.2283 37.7513 16.3004 17.8343
temp: 298.150 k
press: 1.00000 atm
elementType: 8 6 6 6 6 6 6 6 6 6 6 1 1 1 1 1 1 1 1 1 1 1 1 1 1 1 1
symmnumber: 1
zpe: 616030.5 jmol-1
zpe.correction: 0.234634 hartree
zpe.thermalcorrener: 0.247253 hartree
zpe.thermalcorrenthalpy: 0.248197 hartree
zpe.thermalcorrgfe: 0.193215 hartree
zpe.sumelectzpe: -465.014965 hartree
zpe.sumelectthermal: -465.002346 hartree
zpe.sumelectthermalent: -465.001402 hartree
zpe.sumelectthermalfe: -465.056383 hartree
dipole: 0.9397 3.3377 0.5143
dipole: 3.5054
quadrupole: -61.8012 -71.4239 -67.3765
quadrupole: 2.4856 2.2387 -0.7919
quadrupole: 5.0660 -4.5567 -0.5093 2.4856 2.2387 -0.7919
hfenergy: -465.2495985 hartree
pointgroup: C01 [X(C10H16O1)]
dipole: -0.3380392 1.3370658 -0.0038668 debye
polarizability: 132.2488091|-8.8189098|111.1975665|4.2603315|2.3166551|82.6445258 unknown
InChI: InChI=1S/C10H16O/c1-3-4-5-9-7-6-8(2)10(9)11/h7-8H,3-6H2,1-2H3
charge 0 multiplicity 1
27 atoms
O  -0.712607 -1.812946 -0.084009
C  -2.420784 -0.062407 -0.599366
C  -2.38378 1.457683 -0.269206
C  -0.249179 0.549132 0.413781
C  1.153698 0.370845 0.935052
C  -1.062549 -0.599305 -0.088513
C  -0.998209 1.69063 0.310984
C  2.186356 0.123138 -0.200534
C  -3.608446 -0.8407 0.009122
C  3.612471 -0.117856 0.342916
C  4.645803 -0.34935 -0.780501
H  -2.431846 -0.210593 -1.698192
H  -3.168132 1.730402 0.465265
H  -2.560507 2.093104 -1.158772
H  1.460457 1.254698 1.52734
H  1.17246 -0.507605 1.610653
H  -0.657638 2.685332 0.622368
H  1.864048 -0.754671 -0.79324
H  2.191896 0.993291 -0.887981
H  -4.566617 -0.516039 -0.435159
H  -3.483738 -1.92276 -0.171906
H  -3.663361 -0.682744 1.10214
H  3.922441 0.750212 0.960814
H  3.597375 -0.994968 1.021242
H  5.657864 -0.522493 -0.370522
H  4.699204 0.524933 -1.456545
H  4.373221 -1.229862 -1.39213
