program: Gaussian 09
title: 000085907
version: EM64L-G09RevD.01
frameworkgroup: C1[X(C16H26O6)]
method: RPBEPBE
basis: SDD
operation: Freq
keyword: #pfreq=noraman
keyword: PBEPBE/SDD
title: #p freq=noraman PBEPBE/SDD
converged: YES YES NO NO
title: Mulliken charges:
elementType: O O O O O O C C C C C C C C C C C C C C C C H H H H H H H H H H H H H H H H H H H H H H H H H H
charge: -0.275857 -0.275766 -0.453170 -0.454396 -0.247121 -0.247838 0.049139 0.049982 -0.447468 -0.430137 -0.430195 -0.447193 -0.397459 -0.401004 -0.401036 -0.397455 -0.388903 -0.389029 -0.198705 -0.197899 0.230224 0.229739 0.233199 0.233063 0.208192 0.215195 0.245766 0.205423 0.245091 0.205408 0.215116 0.208212 0.208052 0.198495 0.210008 0.200038 0.210065 0.200151 0.198484 0.208132 0.205387 0.192367 0.205406 0.192558 0.266003 0.265240 0.373100 0.373399
chargesum: 0.00000
title: Mulliken charges with hydrogens summed into heavy atoms:
elementType: O O O O O O C C C C C C C C C C C C C C C C
charge: -0.275857 -0.275766 -0.080071 -0.080997 -0.247121 -0.247838 0.282338 0.283046 -0.024081 0.021051 0.020305 -0.023865 0.009087 0.009042 0.009179 0.009161 0.008851 0.008935 0.067298 0.067341 0.230224 0.229739
polarizability: 2.37564609e+02 1.79824153e-02 1.80447197e+02 5.86930685e+00 -2.07494017e-01 1.52516659e+02
1716.lowfreq: -2.3805 -0.0005 0.0004 0.0007 6.8375 9.7727 19.8426 26.4147 27.1149
frequency: 19.5849 26.1060 27.0811 35.0447 45.0944 74.6147 75.7140 76.9651 91.3714 115.3932 125.5406 192.2822 201.2432 209.8122 219.0962 220.7954 236.4863 260.6403 296.3536 315.0571 324.3616 331.4064 335.1283 345.6945 353.3853 430.6355 433.6066 437.9671 439.9512 446.5501 470.3774 478.2845 545.4875 570.7795 576.4954 576.8861 673.7010 753.4417 785.7814 786.8923 789.2972 790.3398 791.8067 837.9955 839.8529 846.8442 871.0287 876.4622 878.1689 894.6288 894.7566 902.8022 917.8417 923.4924 927.7229 977.7674 994.0947 995.6698 1026.9858 1045.2483 1045.7131 1048.0871 1055.8088 1055.9980 1084.4725 1084.6780 1110.3784 1110.7142 1151.6222 1151.9757 1162.0447 1189.4433 1200.3114 1201.2149 1213.4702 1241.7560 1241.9856 1248.9567 1254.8412 1254.9447 1261.0597 1263.5677 1264.3313 1303.7067 1304.4021 1311.3488 1312.0623 1313.1605 1332.3181 1332.4193 1338.5611 1338.8509 1340.3349 1340.4537 1352.0372 1352.2184 1362.3831 1364.3147 1371.8719 1385.9990 1463.6669 1463.9564 1466.5296 1466.5801 1468.6297 1469.1105 1473.8784 1474.1542 1482.8725 1483.1903 1620.7573 1621.1670 2972.6473 2972.9537 2973.9153 2973.9328 2975.2402 2975.3440 2989.7556 2989.8604 2993.7230 2993.9946 3013.8021 3013.9678 3036.3793 3036.5524 3037.8705 3038.9945 3039.0551 3047.2137 3047.2414 3048.4410 3058.0256 3058.1722 3068.9063 3069.4659 3467.8007 3472.8197
redmass: 4.3081 3.4491 3.1921 4.8480 5.6248 6.8752 6.4646 5.0884 4.1394 4.3613 5.1310 3.9616 3.8968 6.4207 1.8347 1.8779 3.4272 1.8023 4.1216 2.4113 3.7455 2.2962 3.0247 3.7870 3.4276 2.0777 3.0111 1.7356 2.9062 2.0823 2.0424 1.9577 4.1508 2.9737 4.9794 4.2988 5.6453 7.6041 1.7981 1.6154 3.5166 2.2359 2.0567 2.6535 2.6962 4.4792 3.5024 1.9036 1.9077 1.6585 1.6404 2.6409 2.2932 1.7599 2.3336 3.1918 2.6391 2.6735 4.8134 1.9815 1.8864 3.9656 1.0988 1.1009 1.2763 1.2721 2.7330 2.7376 2.2703 2.2953 2.0407 2.9636 1.5049 1.5079 1.7498 1.3087 1.3073 1.4408 1.2740 1.2743 1.3658 1.3123 1.3467 1.1979 1.1918 1.3316 1.3138 1.3754 1.3499 1.3492 1.4554 1.4635 1.4757 1.4740 1.5527 1.5539 1.3487 1.4554 1.3780 1.4905 1.0876 1.0871 1.0896 1.0896 1.0910 1.0912 1.0826 1.0826 1.0975 1.0975 10.4386 10.4633 1.0663 1.0670 1.0615 1.0617 1.0619 1.0624 1.0616 1.0616 1.0642 1.0644 1.0831 1.0832 1.0958 1.0957 1.0836 1.0980 1.0979 1.1010 1.1010 1.0852 1.1025 1.1025 1.1025 1.1024 1.0650 1.0648
irintensity: 0.3884 1.2868 0.1739 0.2945 0.1695 0.7496 9.2690 4.1169 0.0434 4.3397 0.5737 2.1460 1.5062 0.3085 4.0298 0.0662 62.0407 75.2626 7.7809 68.3308 2.0994 0.9323 7.5842 30.7050 58.9769 6.4439 2.7560 6.9618 4.4725 7.4327 1.6736 0.1643 20.1012 2.0740 18.1412 9.3309 12.3527 5.0642 6.0511 0.5125 1.1546 9.3783 1.1981 43.7243 7.0415 8.6046 21.1362 2.0707 8.0031 16.0375 18.6946 8.6989 33.1098 0.2874 15.4234 1.0261 85.8443 32.5609 223.4013 11.9375 4.4027 165.4366 0.3495 0.2111 3.4151 2.9523 1.4616 1.4616 16.3749 0.9171 247.2657 175.5916 24.9819 1.8863 497.4472 0.2555 0.4044 65.9914 2.3356 3.8318 3.4170 0.9592 10.3371 12.6988 2.0864 2.9425 0.8014 5.3242 0.4424 0.4335 0.7516 0.6455 0.3961 0.4397 1.3600 1.4139 5.2634 0.0993 23.4715 46.9228 1.8420 3.5476 10.2274 14.7916 6.4225 6.1490 24.4907 20.0815 4.3682 4.2350 130.7703 213.9486 34.1493 28.1597 20.3853 47.9228 33.6232 36.7390 14.1122 12.5891 12.6812 13.3329 25.1576 13.0320 83.2876 36.6516 1.6917 46.7851 67.6186 38.7367 34.6732 22.8677 22.0806 51.7941 48.8093 48.0631 64.3439 31.2285
temp: 298.150 k
press: 1.00000 atm
elementType: 8 8 8 8 8 8 6 6 6 6 6 6 6 6 6 6 6 6 6 6 6 6 1 1 1 1 1 1 1 1 1 1 1 1 1 1 1 1 1 1 1 1 1 1 1 1 1 1
symmnumber: 1
zpe: 1064426.9 jmol-1
zpe.correction: 0.405419 hartree
zpe.thermalcorrener: 0.428292 hartree
zpe.thermalcorrenthalpy: 0.429236 hartree
zpe.thermalcorrgfe: 0.350569 hartree
zpe.sumelectzpe: -1074.916789 hartree
zpe.sumelectthermal: -1074.893915 hartree
zpe.sumelectthermalent: -1074.892971 hartree
zpe.sumelectthermalfe: -1074.971639 hartree
dipole: -0.0302 4.2051 0.0053
dipole: 4.2052
quadrupole: -105.3324 -135.6302 -135.8930
quadrupole: 0.0434 1.5677 -0.0859
quadrupole: 20.2861 -10.0117 -10.2744 0.0434 1.5677 -0.0859
hfenergy: -1075.3222074 hartree
pointgroup: C01 [X(C16H26O6)]
dipole: -0.0123903 1.6538648 -0.0427228 debye
polarizability: 237.312697|0.2387866|180.4160792|7.4668431|-0.9501804|152.7996892 unknown
InChI: InChI=1S/C16H26O6/c17-13(15(19)21-11-7-3-1-4-8-11)14(18)16(20)22-12-9-5-2-6-10-12/h11-14,17-18H,1-10H2
charge 0 multiplicity 1
48 atoms
O  2.297303 0.144842 -0.406875
O  -2.274155 0.170928 0.436195
O  -0.374742 -2.168429 -1.335809
O  0.408405 -2.052076 1.53881
O  2.349485 -2.012051 -1.317067
O  -2.314923 -1.905094 1.518933
C  3.806443 0.245177 -0.421969
C  -3.782922 0.272541 0.46337
C  4.125565 1.741602 -0.509816
C  4.374869 -0.410873 0.847431
C  -4.367861 -0.468011 -0.750704
C  -4.102792 1.771289 0.453288
C  5.657896 1.965618 -0.436464
C  5.907849 -0.185244 0.916414
C  -5.902229 -0.249376 -0.81105
C  -5.636624 1.988415 0.389893
C  6.260531 1.31911 0.834202
C  -6.258237 1.256448 -0.824175
C  0.202675 -1.00025 -0.701447
C  -0.174468 -0.940003 0.814247
C  1.728836 -1.026133 -0.849057
C  -1.699645 -0.959115 0.968424
H  4.160771 -0.297052 -1.320452
H  -4.12503 -0.207265 1.401211
H  3.631113 2.260818 0.334501
H  3.710733 2.161401 -1.444782
H  4.135253 -1.488937 0.854928
H  3.888689 0.046344 1.731476
H  -4.126714 -1.544126 -0.689681
H  -3.895758 -0.070623 -1.670647
H  -3.673705 2.254594 1.350351
H  -3.622986 2.231702 -0.432548
H  5.873212 3.050524 -0.458444
H  6.140129 1.526636 -1.33414
H  6.301533 -0.62545 1.851698
H  6.398586 -0.724051 0.079791
H  -6.30933 -0.751967 -1.70836
H  -6.378513 -0.731666 0.067366
H  -6.10276 1.610405 1.323222
H  -5.854197 3.072018 0.341994
H  7.359008 1.454083 0.845028
H  5.863002 1.837166 1.731096
H  -7.357191 1.387912 -0.825359
H  -5.877766 1.713862 -1.760565
H  -0.200527 -0.097293 -1.193221
H  0.224685 0.00179 1.231205
H  0.354662 -2.840004 -1.439975
H  -0.32216 -2.707937 1.713331
