program: Gaussian 09
title: 000085867
version: EM64L-G09RevD.01
frameworkgroup: C1[X(C16H28N4O2)]
method: RPBEPBE
basis: SDD
operation: Freq
keyword: #p
keyword: freq=noraman
keyword: PBEPBE/SDD
title: #p freq=noraman PBEPBE/SDD
converged: YES YES NO NO
title: Mulliken charges:
elementType: O O N N N N C C C C C C C C C C C C C C C C H H H H H H H H H H H H H H H H H H H H H H H H H H H H
charge: -0.298426 -0.298326 -0.065072 -0.064779 -0.023358 -0.023195 0.378671 0.378418 -0.474976 -0.474500 0.194456 0.193558 -0.782196 -0.731373 -0.731264 -0.782313 -0.715349 -0.715040 -0.169292 -0.169034 -0.515834 -0.515829 0.222226 0.227001 0.222033 0.226985 0.249899 0.217028 0.249118 0.230154 0.222391 0.214003 0.214065 0.222289 0.230122 0.249520 0.217056 0.249551 0.235776 0.241160 0.242266 0.235786 0.241093 0.242207 0.219162 0.236852 0.195598 0.219133 0.236923 0.195655
chargesum: 0.00000
title: Mulliken charges with hydrogens summed into heavy atoms:
elementType: O O N N N N C C C C C C C C C C C C C C C C
charge: -0.298426 -0.298326 -0.065072 -0.064779 -0.023358 -0.023195 0.378671 0.378418 -0.025749 -0.025482 0.194456 0.193558 -0.066152 -0.064825 -0.064788 -0.066186 0.003854 0.004046 -0.169292 -0.169034 0.135778 0.135882
polarizability: 2.23915821e+02 -3.55967125e-02 1.89871166e+02 -2.08850304e+00 9.91158276e-03 1.96456269e+02
1716.lowfreq: -22.7667 -20.9894 -9.9602 -0.0007 -0.0006 -0.0003 8.0267 24.5553 31.7592
frequency: -18.1585 19.1952 31.6053 35.3833 58.9704 62.8062 65.7361 90.0234 98.1662 99.1876 122.5190 134.9064 148.1550 158.6837 168.2124 181.9691 186.6522 200.5556 200.8643 211.1446 221.7692 241.5135 245.0950 258.2549 263.0091 277.6360 280.6468 285.6978 291.1462 299.4516 321.4398 348.5269 350.9558 360.4192 367.0039 389.5984 393.7063 430.5026 430.8290 438.1068 466.1935 523.7372 527.4723 571.9913 601.5266 610.5093 651.7751 694.6327 694.9638 725.3277 738.1669 788.5974 815.7786 822.9950 846.6988 905.0849 916.4179 919.5191 922.9718 952.9142 954.4270 987.9540 988.7240 993.7659 995.1328 1020.0325 1022.2350 1033.0976 1041.0344 1082.4703 1102.3352 1110.4706 1110.7178 1150.5888 1150.9058 1155.4147 1158.9531 1175.6734 1180.0472 1206.3389 1215.7690 1257.9577 1259.5824 1304.0079 1307.0121 1349.0978 1350.6141 1374.6222 1377.4233 1377.5843 1379.1147 1391.2023 1398.7261 1427.0437 1427.3730 1431.7384 1432.2467 1456.2975 1456.7912 1459.3339 1460.1650 1461.9772 1462.6443 1465.5288 1465.7442 1467.2834 1469.3792 1477.1484 1477.3824 1478.1481 1479.2296 1482.5794 1493.9520 1499.3697 2185.6727 2186.0148 2941.1455 2941.3453 2982.3737 2982.6377 2987.0570 2987.7288 2996.1288 2996.6251 3009.2913 3009.4179 3023.4508 3023.6347 3072.8866 3072.9922 3076.4674 3076.8957 3081.9958 3082.8355 3087.4434 3087.8260 3092.2410 3094.4661 3100.2062 3100.3784 3102.6603 3102.7732 3113.3016 3114.2099
redmass: 3.3405 3.2825 4.5734 5.1892 3.5533 3.2447 3.0738 4.5062 2.7067 2.4453 3.4547 2.8132 3.0744 4.9041 2.7754 1.4001 1.4124 1.5027 3.3217 1.4633 2.2825 1.2530 1.0812 2.0377 2.6108 1.6013 2.0948 1.8908 1.5047 1.7099 3.4190 2.7894 4.4940 2.5660 3.9103 2.3604 2.0914 3.4048 3.6363 3.2402 5.2379 3.2693 2.8971 6.4958 4.7416 5.1830 4.1171 4.5090 4.4680 4.2998 3.7508 3.2223 2.8122 2.9509 4.9614 1.7809 1.6559 1.5267 1.7850 1.7242 1.7577 1.3564 1.3333 1.5895 1.5881 7.2031 7.6943 3.8689 2.6754 1.7173 1.9181 1.2721 1.2845 1.4172 1.4135 2.3344 2.3251 2.9937 3.1549 3.3531 3.2209 2.5576 2.6571 1.4336 1.4552 1.4167 1.4351 1.2183 1.2015 1.2201 1.2082 1.2114 1.2102 1.0802 1.0828 1.1289 1.1297 1.0551 1.1144 1.3871 1.0534 1.0740 1.0510 1.0621 1.0522 1.0505 1.4170 1.3382 1.0702 1.1570 1.0534 1.0587 1.0547 1.0617 12.6516 12.6489 1.0345 1.0345 1.0354 1.0354 1.0362 1.0360 1.0339 1.0340 1.0588 1.0587 1.1011 1.1010 1.1021 1.1022 1.0998 1.0996 1.0990 1.0987 1.1004 1.1004 1.0995 1.0993 1.0978 1.0978 1.1008 1.1009 1.1016 1.1015
irintensity: 1.4595 0.8015 0.9354 1.1805 0.0954 3.4113 1.1679 13.9159 0.1156 4.5062 0.1698 2.0808 0.1604 5.1359 0.6403 0.1296 4.2201 0.1223 2.3763 6.1914 0.4689 0.3872 0.0078 3.2216 0.2110 0.0107 0.4534 0.2720 0.0797 0.5729 0.8001 0.6708 0.0580 0.4987 14.9579 5.0583 0.4511 21.2177 0.6752 0.8362 6.0754 1.0372 3.4117 7.4074 2.6663 4.0900 0.7684 11.9808 1.6445 11.3402 0.2808 5.5519 0.6892 8.7082 0.4894 1.9562 0.4445 0.2723 0.0000 4.5051 1.3059 2.3985 0.6727 3.0218 2.1169 48.5642 88.5501 11.6303 0.7962 5.2007 0.6297 0.1196 1.0756 2.6051 9.3742 120.9644 16.7062 46.1776 1.2510 69.5560 6.8445 3.2627 29.8938 4.4784 0.4152 6.3446 27.2499 64.1374 5.5170 2.3123 6.4126 28.0023 13.4931 4.5577 7.3544 1.3142 3.0447 13.2658 1.1474 0.7966 6.4165 1.4123 2.2322 1.2669 33.8262 19.2836 0.2689 2.8146 10.4593 0.0554 15.0495 12.6038 17.3831 14.5751 6.8733 0.4679 19.8613 120.5568 38.8311 1.1639 6.1049 20.0595 1.1077 19.0250 21.0234 12.1418 78.4618 49.3533 0.9331 6.5330 3.2186 0.4276 62.1434 64.5914 21.1032 24.5273 34.9749 6.3791 32.5236 17.2901 0.2954 25.0212 30.4118 3.2326
temp: 298.150 k
press: 1.00000 atm
elementType: 8 8 7 7 7 7 6 6 6 6 6 6 6 6 6 6 6 6 6 6 6 6 1 1 1 1 1 1 1 1 1 1 1 1 1 1 1 1 1 1 1 1 1 1 1 1 1 1 1 1
symmnumber: 1
zpe: 1093828.3 jmol-1
zpe.correction: 0.416617 hartree
zpe.thermalcorrener: 0.443826 hartree
zpe.thermalcorrenthalpy: 0.444771 hartree
zpe.thermalcorrgfe: 0.359780 hartree
zpe.sumelectzpe: -994.087338 hartree
zpe.sumelectthermal: -994.060129 hartree
zpe.sumelectthermalent: -994.059185 hartree
zpe.sumelectthermalfe: -994.144175 hartree
dipole: -0.0017 0.1834 -0.0051
dipole: 0.1835
quadrupole: -129.9335 -113.2105 -155.9306
quadrupole: -0.0477 16.2149 -0.0108
quadrupole: 3.0914 19.8144 -22.9058 -0.0477 16.2149 -0.0108
hfenergy: -994.5039551 hartree
pointgroup: C01 [X(C16H28N4O2)]
dipole: -0.0010759 0.0721231 -0.0027009 debye
polarizability: 221.4734409|-0.1602252|189.8733027|-8.0894396|0.1386375|198.8965129 unknown
InChI: InChI=1S/C16H28N4O2/c1-13(2,21-7)9-15(5,11-17)19-20-16(6,12-18)10-14(3,4)22-8/h9-10H2,1-8H3
charge 0 multiplicity 1
50 atoms
O  3.661857 -0.746039 -1.414318
O  -3.655758 -0.713045 1.434223
N  0.573681 1.570108 0.256641
N  -0.577616 1.565798 -0.296103
N  1.084446 0.621406 -3.109774
N  -1.085203 0.705142 3.09462
C  3.177516 -0.495406 -0.024655
C  -3.178373 -0.492771 0.037103
C  2.98914 1.041656 -0.022402
C  -2.993289 1.044207 -0.000721
C  1.749408 1.654802 -0.735474
C  -1.752487 1.675607 0.694456
C  1.883999 -1.274125 0.294782
C  4.296258 -0.858465 0.981634
C  -4.30084 -0.880688 -0.955644
C  -1.884213 -1.275191 -0.270662
C  1.979332 3.187419 -0.923925
C  -1.982393 3.212579 0.84345
C  1.4179 1.054975 -2.049805
C  -1.419399 1.110078 2.023624
C  3.73142 -2.137894 -1.854223
C  -3.718185 -2.094705 1.906157
H  2.937307 1.399799 1.02252
H  3.896401 1.466633 -0.488464
H  -2.945887 1.378501 -1.053717
H  -3.899778 1.478025 0.458672
H  1.145222 -1.17785 -0.519176
H  2.094028 -2.348754 0.440796
H  1.431432 -0.887056 1.225251
H  5.202667 -0.259115 0.784672
H  3.96683 -0.673454 2.020273
H  4.565816 -1.926935 0.90204
H  -4.566591 -1.948051 -0.852029
H  -3.977112 -0.716557 -1.999579
H  -5.208133 -0.280055 -0.766766
H  -1.435892 -0.906555 -1.210608
H  -2.09192 -2.353174 -0.393398
H  -1.143026 -1.159817 0.538593
H  2.175034 3.652769 0.058174
H  1.092288 3.658819 -1.378909
H  2.851185 3.354125 -1.57771
H  -2.179997 3.652239 -0.150033
H  -1.094672 3.695944 1.284336
H  -2.853037 3.396043 1.494342
H  2.730845 -2.609992 -1.907388
H  4.15841 -2.097089 -2.868898
H  4.39238 -2.753529 -1.208938
H  -2.715794 -2.562355 1.96358
H  -4.138863 -2.032082 2.922348
H  -4.381243 -2.726824 1.279234
