program: Gaussian 09
title: 000085812
version: EM64L-G09RevD.01
frameworkgroup: C1[X(C12H14N2O)]
method: RPBEPBE
basis: SDD
operation: Freq
keyword: #p
keyword: freq=noraman
keyword: PBEPBE/SDD
title: #p freq=noraman PBEPBE/SDD
converged: YES YES NO NO
title: Mulliken charges:
elementType: O N N C C C C C C C C C C C C H H H H H H H H H H H H H H
charge: -0.242272 -0.143499 0.002285 -0.346220 -0.347845 -0.163223 -0.328302 -0.324643 0.432768 -0.350424 -0.431793 -0.214534 -0.224726 -0.219777 -0.236862 0.199511 0.238358 0.241561 0.196761 0.232949 0.196948 0.218866 0.220185 0.197425 0.266257 0.236222 0.230580 0.230689 0.232757
chargesum: 0.00000
title: Mulliken charges with hydrogens summed into heavy atoms:
elementType: O N N C C C C C C C C C C C C
charge: -0.242272 -0.143499 0.002285 0.091648 0.090476 0.069727 0.087512 0.092966 0.432768 -0.084167 -0.195571 -0.214534 0.005854 0.010912 -0.004105
polarizability: 1.61111300e+02 1.96269209e+01 1.26068472e+02 3.39818469e+00 -9.30362194e-01 1.20515392e+02
1716.lowfreq: -16.1797 -10.0189 -0.0008 -0.0003 -0.0003 6.0004 24.3569 48.6258 63.4145
frequency: 23.9914 48.2592 63.3770 89.3795 120.3383 175.7128 219.6418 239.3248 284.1161 300.3687 318.4554 395.1968 398.2906 403.5175 426.9450 465.0765 519.3971 538.7856 611.6509 624.6201 636.1806 703.9073 761.7446 792.4220 810.7519 826.4349 842.6726 856.2450 896.4483 926.5904 963.2047 980.6201 990.9313 998.7723 1005.2433 1025.2434 1025.9960 1051.5458 1078.0206 1083.2499 1097.4815 1111.4773 1151.7551 1173.8426 1184.1436 1189.1174 1197.7093 1244.8049 1260.1581 1273.9062 1290.3062 1292.9977 1330.0725 1336.5777 1347.3868 1372.3424 1377.8671 1387.8287 1442.5981 1443.3102 1450.1154 1452.5110 1463.6829 1480.4085 1597.8288 1611.1245 2191.3440 2825.9154 2871.1751 2882.3666 2957.7797 2962.5729 3047.1003 3052.9084 3085.2096 3088.7041 3120.1516 3130.7784 3142.9167 3154.3857 3167.6364
redmass: 4.0970 3.0674 5.0171 5.7442 9.3467 4.2211 3.0717 2.4743 4.4307 3.1991 4.2345 1.9167 5.6487 2.8123 7.0125 2.9002 4.5353 3.7512 4.6174 2.9123 4.6048 1.7987 1.9723 4.1246 4.2969 3.9526 1.6002 1.2482 2.7456 1.4870 3.2954 1.3957 6.1629 1.5280 2.2330 2.1819 2.1787 2.0637 1.7281 3.6352 2.4045 2.3754 4.1616 1.0650 1.1314 1.2708 1.6098 1.3099 1.2687 1.5164 1.2435 1.2710 1.2761 1.2551 1.3023 1.2938 1.5651 5.1900 2.0312 1.0977 1.0927 1.0955 1.1058 2.2928 6.2170 6.1296 12.6018 1.0791 1.0706 1.0691 1.0669 1.0668 1.0896 1.0897 1.0960 1.0978 1.0878 1.0867 1.0914 1.0960 1.1015
irintensity: 0.1745 0.2198 0.3818 4.6592 4.6596 2.2317 2.1477 1.2885 1.6408 7.0424 4.8236 0.2616 1.2287 0.2049 3.5357 1.1409 1.5933 17.5948 0.3406 1.6872 4.6351 51.0964 47.3723 7.0167 33.9396 9.2973 0.4249 0.0861 5.0969 7.5390 22.5341 0.4566 2.4136 11.5217 19.9935 10.2655 4.2746 24.1020 15.7902 39.3408 13.0003 28.8904 7.5524 0.4975 3.0058 2.9350 3.7972 16.2120 14.3555 21.1249 15.9871 4.6209 0.9852 0.4863 4.6777 3.4031 2.1742 1.8827 13.6648 3.0622 1.3967 18.5972 5.4270 11.8196 0.7514 1.1259 4.2685 44.0388 40.9146 110.1669 34.4694 88.8312 22.5366 21.7585 33.6963 31.4195 5.9674 0.3837 15.2610 24.0876 19.9656
temp: 298.150 k
press: 1.00000 atm
elementType: 8 7 7 6 6 6 6 6 6 6 6 6 6 6 6 1 1 1 1 1 1 1 1 1 1 1 1 1 1
symmnumber: 1
zpe: 620652.3 jmol-1
zpe.correction: 0.236394 hartree
zpe.thermalcorrener: 0.249724 hartree
zpe.thermalcorrenthalpy: 0.250668 hartree
zpe.thermalcorrgfe: 0.195076 hartree
zpe.sumelectzpe: -649.245378 hartree
zpe.sumelectthermal: -649.232047 hartree
zpe.sumelectthermalent: -649.231103 hartree
zpe.sumelectthermalfe: -649.286696 hartree
dipole: -1.5322 -3.0055 -1.1690
dipole: 3.5703
quadrupole: -88.4842 -103.1478 -82.3659
quadrupole: 10.6319 2.5054 -4.7353
quadrupole: 2.8484 -11.8151 8.9667 10.6319 2.5054 -4.7353
hfenergy: -649.4817715 hartree
pointgroup: C01 [X(C12H14N2O1)]
dipole: 0.6251042 1.1322843 -0.5479912 debye
polarizability: 161.6854054|18.8822901|125.7892093|-4.2849133|0.8515198|120.2205489 unknown
InChI: InChI=1S/C12H14N2O/c13-10-12(11-4-2-1-3-5-11)14-6-8-15-9-7-14/h1-5,12H,6-9H2
charge 0 multiplicity 1
29 atoms
O  -3.751708 1.343749 -0.256575
N  -1.231072 -0.084534 -0.009737
N  -0.019803 -3.291615 0.705223
C  -1.313771 1.219973 -0.725385
C  -2.525879 -0.814774 -0.129864
C  -0.057699 -0.885523 -0.471606
C  -2.467277 2.053235 -0.145121
C  -3.657793 0.052424 0.443499
C  1.274479 -0.174232 -0.181529
C  1.538436 0.325914 1.117151
C  2.24821 -0.037887 -1.196988
C  -0.055992 -2.216111 0.190773
C  2.767788 0.961038 1.393153
C  3.481328 0.596799 -0.919789
C  3.743309 1.096845 0.375778
H  -1.483483 1.068274 -1.820966
H  -0.363346 1.76707 -0.596547
H  -2.466206 -1.759663 0.439793
H  -2.755994 -1.063103 -1.195796
H  -0.11113 -1.087604 -1.574628
H  -2.256493 2.284428 0.921248
H  -2.59689 2.991414 -0.709122
H  -4.636114 -0.434656 0.300696
H  -3.480225 0.223901 1.526841
H  0.77285 0.220284 1.893385
H  2.046943 -0.427122 -2.202777
H  2.969185 1.345676 2.399063
H  4.232121 0.699648 -1.71084
H  4.698923 1.587052 0.592465
