program: Gaussian 09
title: 000085798
version: EM64L-G09RevD.01
frameworkgroup: C1[X(C3H5Br2NO)]
method: RPBEPBE
basis: SDD
operation: Freq
keyword: #p
keyword: freq=noraman
keyword: PBEPBE/SDD
title: #p freq=noraman PBEPBE/SDD
converged: YES YES NO NO
title: Mulliken charges:
elementType: Br Br O N C C C H H H H H
charge: 0.026934 0.005445 -0.228388 -0.597868 -0.541933 -0.629246 0.331072 0.320985 0.301999 0.333243 0.329977 0.347780
chargesum: 0.00000
title: Mulliken charges with hydrogens summed into heavy atoms:
elementType: Br Br O N C C C
charge: 0.026934 0.005445 -0.228388 0.079888 -0.220948 0.005996 0.331072
polarizability: 1.09770321e+02 -1.07880565e+01 6.09118350e+01 1.82447411e+00 -4.48252461e+00 5.26664297e+01
1716.lowfreq: -6.7517 0.0001 0.0002 0.0005 4.8155 7.3127 51.5102 78.4691 126.4295
frequency: 51.4838 78.4586 126.4291 151.3381 186.5627 258.2967 433.1480 478.6182 508.2118 569.8374 590.9466 635.6014 743.9865 764.1692 923.3427 1056.3817 1082.3198 1136.0019 1157.7158 1231.9481 1282.2331 1371.3480 1423.0003 1601.0304 1657.6582 3081.4136 3087.1694 3180.0832 3520.4968 3672.2200
redmass: 4.8887 8.5046 7.1859 6.3295 20.0000 3.1978 3.0418 1.7537 1.7573 3.7618 3.1256 1.7273 4.9385 2.9475 1.5498 1.7047 2.1532 1.1541 1.4932 1.1997 1.5910 2.6378 1.1151 1.4015 3.7511 1.0608 1.0827 1.1126 1.0453 1.1045
irintensity: 12.0841 1.9517 1.9164 5.2017 0.7477 15.8857 24.2384 44.8091 25.4043 41.1816 114.8197 139.8344 0.9626 3.4211 10.9637 1.2573 2.7921 10.0480 9.0034 11.3635 60.5495 83.6553 29.2177 46.9905 286.8381 4.6467 4.8033 0.3353 50.1318 34.2073
temp: 298.150 k
press: 1.00000 atm
elementType: 35 35 8 7 6 6 6 1 1 1 1 1
symmnumber: 1
zpe: 215575.7 jmol-1
zpe.correction: 0.082108 hartree
zpe.thermalcorrener: 0.090534 hartree
zpe.thermalcorrenthalpy: 0.091478 hartree
zpe.thermalcorrgfe: 0.045824 hartree
zpe.sumelectzpe: -273.675919 hartree
zpe.sumelectthermal: -273.667494 hartree
zpe.sumelectthermalent: -273.666549 hartree
zpe.sumelectthermalfe: -273.712204 hartree
dipole: 1.3414 0.6722 -3.5407
dipole: 3.8455
quadrupole: -65.7100 -53.7499 -60.2057
quadrupole: 3.4287 -1.9724 -9.0918
quadrupole: -5.8215 6.1386 -0.3171 3.4287 -1.9724 -9.0918
hfenergy: -273.7580276 hartree
pointgroup: C01 [X(C3H5Br2N1O1)]
dipole: 0.4924734 0.1965494 -1.4169825 debye
dipolederiv: -0.5146474 0.2527171 0.0637118 0.2476578 -0.4038753 -0.0578544 0.0887183 -0.0601513 -0.1153341 -0.5824953 0.2063263 0.058544 0.1972384 -0.2162426 -0.0003954 0.0063557 0.0204065 -0.1236881 -0.4235732 -0.1672936 -0.00468 -0.1099118 -0.5255229 -0.1497655 0.1764206 0.0153779 -0.95123 -0.7068436 -0.0925794 0.2602995 -0.1080556 -0.7339632 0.4502128 0.1733753 0.3110228 -0.6399565 0.6213292 -0.4530095 -0.0351428 -0.3623383 0.2290278 -0.0081907 -0.0942593 -0.0527346 0.0311964 0.5550892 -0.3232852 0.0365876 -0.2772174 0.1780352 -0.0353207 -0.0192183 -0.0155109 0.0586046 0.4173411 0.544909 -0.2853135 0.4065712 0.956501 -0.1540889 -0.3627579 -0.123649 1.3118045 -0.0025441 0.0348984 -0.0273296 0.0445638 -0.0206541 0.0554947 0.0010792 -0.0122288 -0.0529115 -0.0253103 0.0586308 -0.0157903 0.0014616 -0.0579219 -0.0152538 -0.0265115 -0.0259137 0.1061141 0.0419606 0.0899618 -0.0786601 0.0974521 0.0992238 0.0063484 0.0251832 0.0183285 0.0346958 0.3077168 -0.062731 0.0151979 -0.0617006 0.2391987 -0.0488706 0.0045258 -0.0633015 0.16858 0.3119769 -0.0885448 0.0125755 -0.0757211 0.2561935 -0.0423159 0.0270889 -0.0116459 0.1721249 unknown
polarizability: 93.2490926|-25.1665103|77.5973631|-6.0497747|-0.0771773|52.5021301 unknown
InChI: InChI=1S/C3H5Br2NO/c4-1-2(5)3(6)7/h2H,1,6H2
charge 0 multiplicity 1
12 atoms
Br 1.297915 -2.013194 -0.524162
Br -2.859072 0.254511 -0.058896
O  0.523321 1.01386 1.276284
N  1.204614 1.543174 -0.8852
C  -0.114375 -0.508816 -0.542074
C  -1.284679 -0.988148 0.297565
C  0.563181 0.749396 0.042907
H  -0.370424 -0.412261 -1.608715
H  -1.637769 -1.987744 0.013616
H  -1.071139 -0.896618 1.371878
H  1.242894 1.306556 -1.875257
H  1.696032 2.373784 -0.555246
