program: Gaussian 09
title: 000085794
version: EM64L-G09RevD.01
frameworkgroup: C1[X(C9H11NO)]
method: RPBEPBE
basis: SDD
operation: Freq
keyword: #p
keyword: freq=noraman
keyword: PBEPBE/SDD
title: #p freq=noraman PBEPBE/SDD
converged: YES YES NO NO
title: Mulliken charges:
elementType: O N C C C C C C C C C H H H H H H H H H H H
charge: -0.442961 -0.598866 -0.161057 -0.233504 -0.584809 0.286811 0.288909 -0.405493 -0.423640 -0.228784 -0.226629 0.255536 0.194513 0.243611 0.213590 0.260503 0.240554 0.275464 0.264343 0.333933 0.224503 0.223472
chargesum: 0.00000
title: Mulliken charges with hydrogens summed into heavy atoms:
elementType: O N C C C C C C C C C
charge: -0.109028 -0.059059 0.094479 -0.038990 -0.127608 0.286811 0.288909 -0.144990 -0.183086 -0.004282 -0.003157
polarizability: 1.36033012e+02 -4.77105683e-02 1.07927873e+02 -3.61017730e+00 1.66945082e+00 5.89140860e+01
1716.lowfreq: -9.5391 -6.9685 0.0006 0.0008 0.0008 7.4619 77.2669 132.9552 176.2146
frequency: 77.2559 132.9527 176.2086 214.4428 242.2741 261.6541 283.7664 333.6407 394.6423 422.0664 452.7440 481.6794 496.3525 525.0860 596.1560 637.3271 718.6530 752.3232 801.6346 840.0825 845.1484 880.9640 934.7649 954.1007 988.2548 1008.2300 1020.2010 1027.3055 1098.6033 1104.8392 1129.8810 1151.6338 1167.5525 1168.7296 1190.6986 1226.1546 1234.6249 1256.9484 1285.8220 1297.0314 1359.6901 1385.3385 1392.8561 1450.4887 1457.8660 1475.0387 1596.4769 1624.3360 1631.5740 2893.4170 2961.6818 3012.9223 3062.2975 3119.5699 3132.0495 3147.6650 3162.4772 3493.2777 3551.1025 3630.0119
redmass: 3.5802 4.0273 1.8108 2.3837 1.9057 2.2752 1.2066 2.2766 1.7311 3.3628 3.8023 4.0101 2.9922 3.5837 5.3580 4.8102 3.6728 1.3211 2.9919 2.2615 3.2806 1.4030 1.6260 1.5209 1.3194 4.0943 2.3930 3.7129 1.3956 1.8790 2.2104 1.4009 1.3716 1.2172 1.5856 1.4893 1.7588 1.2675 1.7044 1.4415 1.5615 1.4775 5.1205 2.4134 1.1643 2.7316 6.9145 7.3293 1.1054 1.0822 1.0684 1.0851 1.0944 1.0856 1.0899 1.0946 1.0996 1.0444 1.0659 1.1000
irintensity: 6.2726 3.1686 55.7329 55.9207 66.8006 89.3382 23.9354 31.8844 141.4530 46.7159 13.5248 8.8958 3.8433 18.8369 6.0597 5.8920 1.8967 70.4675 22.7342 0.6514 8.0726 0.3385 2.5879 6.1663 0.2011 50.8877 14.4857 8.3397 11.1204 3.1761 36.8844 63.6046 3.3721 9.6244 14.7427 1.2831 0.6261 0.8418 13.1778 1.1422 12.3885 4.9310 6.5980 6.2502 14.5311 13.2895 0.8382 1.5293 49.3800 59.9799 35.1460 23.3163 26.2147 1.3851 14.4486 28.2105 25.6226 1.2809 1.4575 2.6501
temp: 298.150 k
press: 1.00000 atm
elementType: 8 7 6 6 6 6 6 6 6 6 6 1 1 1 1 1 1 1 1 1 1 1
symmnumber: 1
zpe: 474633.8 jmol-1
zpe.correction: 0.180778 hartree
zpe.thermalcorrener: 0.190793 hartree
zpe.thermalcorrenthalpy: 0.191737 hartree
zpe.thermalcorrgfe: 0.145980 hartree
zpe.sumelectzpe: -478.709242 hartree
zpe.sumelectthermal: -478.699227 hartree
zpe.sumelectthermalent: -478.698283 hartree
zpe.sumelectthermalfe: -478.744040 hartree
dipole: -1.7874 -0.2893 1.4059
dipole: 2.2924
quadrupole: -52.6943 -65.2830 -66.8267
quadrupole: -5.1359 -3.3791 1.4922
quadrupole: 8.9070 -3.6817 -5.2253 -5.1359 -3.3791 1.4922
hfenergy: -478.8900207 hartree
pointgroup: C01 [X(C9H11N1O1)]
dipole: 0.6920191 -0.1085156 -0.5681431 debye
dipolederiv: -0.2798135 -0.0825604 -0.1848322 -0.2092353 -0.8225183 -0.0135587 -0.2463158 -0.083475 -0.4820314 -0.8559749 0.2131552 0.0211068 0.3609824 -0.7070913 0.1933711 0.046345 0.1773117 -0.2484949 0.8182892 -0.1296358 -0.0823219 -0.1367012 0.1438927 -0.0560855 -0.0531055 0.0007166 0.1712959 0.2253208 0.2414297 0.078112 0.3605224 0.5571284 0.093027 0.071515 0.1230947 0.4266258 -0.1416204 -0.0055798 -0.0041935 -0.0492793 0.0127676 -0.0308445 -0.0221743 -0.0355976 0.1813023 0.0249551 -0.0026114 -0.0330304 0.2124958 -0.1377378 -0.0280971 -0.136382 -0.0438009 -0.060526 0.1327745 -0.12933 -0.0071501 -0.2623949 0.0351891 0.0088198 -0.0661757 0.0331619 -0.0505171 -0.0673411 0.0334706 -0.002766 -0.019242 0.104465 -0.0158141 0.0560305 0.0175415 -0.1343073 -0.1202462 0.0760628 -0.0130798 0.0750377 0.095644 -0.0244128 0.0060542 -0.0337783 -0.1589107 0.0059626 -0.072393 -0.0128029 -0.1035841 -0.0192224 -0.0011796 -0.0097463 -0.004297 -0.1704348 0.0497076 0.0235603 -0.0242269 0.0729413 -0.0092768 -0.0192414 -0.0222787 -0.0197795 -0.1577659 0.0310292 0.004441 0.0013692 0.0216578 0.0447859 -0.0418016 -0.0095249 -0.0245751 -0.1219659 -0.0874996 -0.0430612 0.0869726 -0.0782316 -0.032324 -0.0187955 0.0700848 -0.0074194 -0.2082239 0.031058 0.0091017 -0.0043933 0.025095 -0.0753649 0.0891123 -0.0396729 0.1336352 0.0139668 -0.0188853 0.0650439 0.0524359 0.04165 0.0381514 -0.0522412 0.070876 -0.1141392 -0.1112244 0.1002646 -0.0272713 0.0069107 -0.0042217 -0.0708096 0.0228028 0.0086228 0.0162637 0.1507029 0.0791129 -0.0072492 0.0055775 -0.0413522 -0.1166151 0.0273851 0.0088213 0.0278325 0.1500594 0.1163378 -0.0676533 0.0150277 -0.2380546 0.2172844 -0.1228452 0.0832723 -0.0965892 0.1937983 0.1725284 -0.0347382 -0.0339052 -0.0763747 0.3296551 0.0131871 0.0421689 -0.0556084 0.0171724 -0.0140861 -0.0968104 0.0968534 0.013837 0.3490458 -0.0405938 0.103846 -0.0275457 0.2880684 -0.0780789 0.1058177 0.0092884 0.1119855 0.0060336 0.0024693 0.0062715 -0.0006318 0.1580979 -0.1237946 -0.0731889 0.0290478 -0.0775333 0.0569172 0.0153364 0.031468 0.0176792 0.1533122 unknown
polarizability: 135.8527038|0.1117376|107.9479668|-5.1810635|-1.3630296|59.0743006 unknown
InChI: InChI=1S/C9H11NO/c10-8-5-6-3-1-2-4-7(6)9(8)11/h1-4,8-9,11H,5,10H2
charge 0 multiplicity 1
22 atoms
O  1.571179 2.094211 0.335989
N  3.296488 -0.713296 -0.20497
C  1.934293 -0.434301 0.242372
C  1.221874 0.840502 -0.34477
C  0.926595 -1.586072 -0.072447
C  -0.248377 0.521246 -0.172755
C  -0.421803 -0.881193 -0.03179
C  -1.348491 1.397667 -0.154979
C  -1.714017 -1.421829 0.118318
C  -2.647403 0.853492 0.000844
C  -2.827996 -0.545493 0.132279
H  1.958234 -0.283195 1.339692
H  1.482077 0.9170 -1.428608
H  1.020063 -2.425881 0.636794
H  1.133152 -1.992384 -1.085523
H  -1.193075 2.478118 -0.240045
H  -1.859868 -2.502331 0.233532
H  4.050983 -0.18411 0.23268
H  3.42211 -0.881004 -1.20533
H  2.513346 2.316759 0.123828
H  -3.519084 1.51746 0.024903
H  -3.838579 -0.952168 0.254887
