program: Gaussian 09
title: 000008299
version: EM64L-G09RevD.01
frameworkgroup: C1[X(C3H6O2)]
method: RPBEPBE
basis: SDD
operation: Freq
keyword: #p
keyword: freq=noraman
keyword: PBEPBE/SDD
title: #p freq=noraman PBEPBE/SDD
converged: YES YES NO NO
title: Mulliken charges:
elementType: O O C C C H H H H H H
charge: -0.446469 -0.235594 -0.345793 0.203130 -0.739850 0.227077 0.226684 0.261609 0.255083 0.231783 0.362341
chargesum: 0.00000
title: Mulliken charges with hydrogens summed into heavy atoms:
elementType: O O C C C
charge: -0.084128 -0.235594 0.107968 0.203130 0.008625
polarizability: 4.52105149e+01 -1.36114689e+00 4.37922778e+01 2.98957793e-01 -1.10141213e-01 2.76239938e+01
1716.lowfreq: 0.0006 0.0006 0.0013 10.4705 14.9907 17.8681 61.5621 139.6618 261.1339
frequency: 61.5481 139.6601 261.1325 391.7292 403.0962 490.2283 592.9380 800.0286 852.3947 971.8236 1034.4406 1069.7837 1184.8766 1191.1864 1259.4159 1375.9515 1385.8122 1444.1299 1446.3850 1458.4640 1622.9227 2944.2805 2985.0699 2988.4437 3078.8245 3115.3267 3418.4109
redmass: 1.1610 2.1859 4.1660 3.1390 1.4342 1.5325 4.3417 3.3507 1.3338 2.2176 3.4998 1.9194 1.1063 2.0769 1.6477 1.2213 1.3352 1.0625 1.0795 1.0692 7.7456 1.0601 1.0967 1.0398 1.0946 1.1015 1.0642
irintensity: 0.2678 8.4382 15.4753 16.1175 60.4471 65.6015 4.3601 17.2373 4.8077 17.9240 108.2864 7.5720 2.8332 18.4155 121.2985 39.3202 101.8324 5.4914 21.8985 14.3437 92.8738 43.5339 24.5327 4.8539 10.6424 10.1488 28.9325
temp: 298.150 k
press: 1.00000 atm
elementType: 8 8 6 6 6 1 1 1 1 1 1
symmnumber: 1
zpe: 227100.9 jmol-1
zpe.correction: 0.086498 hartree
zpe.thermalcorrener: 0.092623 hartree
zpe.thermalcorrenthalpy: 0.093567 hartree
zpe.thermalcorrgfe: 0.056883 hartree
zpe.sumelectzpe: -267.937772 hartree
zpe.sumelectthermal: -267.931647 hartree
zpe.sumelectthermalent: -267.930703 hartree
zpe.sumelectthermalfe: -267.967387 hartree
dipole: 2.9385 -2.1857 -0.0201
dipole: 3.6623
quadrupole: -33.7693 -31.6548 -29.3683
quadrupole: -3.5411 0.3929 0.0456
quadrupole: -2.1719 -0.0573 2.2292 -3.5411 0.3929 0.0456
hfenergy: -268.0242706 hartree
pointgroup: C01 [X(C3H6O2)]
dipole: 1.1211906 -0.9043339 0.0337852 debye
dipolederiv: -0.699792 0.2293283 0.0056565 0.199159 -0.3648649 0.0106991 -0.0003779 0.0213284 -0.5424359 -0.6115421 0.0613388 -0.0293764 0.0452502 -0.8929408 -0.0228417 -0.028393 -0.0260252 -0.3178117 0.1853225 -0.3935554 -0.0716351 -0.5126535 0.0816011 -0.0668858 -0.0922239 -0.0617134 0.3790042 0.9398288 0.014845 0.1260443 0.0134853 0.9869666 0.0440664 0.1360093 0.0359137 0.1073129 -0.4735067 0.1840119 -0.0742683 0.1147215 -0.0477859 0.0377217 -0.1423681 0.0863275 -0.005669 0.0357319 0.0417477 -0.0337689 0.0814905 -0.0188846 0.0937277 -0.0308192 0.1407533 -0.0278422 0.0123546 0.0507755 0.0558052 0.0720898 0.0232996 -0.0708145 0.0671792 -0.1222689 -0.0704906 0.0103201 -0.0441814 0.052688 -0.0604203 0.0357788 0.0623491 0.091633 0.0337137 0.0966028 0.0999181 0.0163847 -0.0112846 0.0272248 0.1138737 -0.0023354 -0.0319516 0.0052325 -0.054263 0.0826032 -0.0338779 -0.0252737 0.0090144 -0.0804761 -0.0806429 0.0182129 -0.0987552 0.0840417 0.4187617 -0.1268174 0.0054129 0.0106382 0.1634327 -0.0050439 0.0130994 -0.0145063 0.3515508 unknown
polarizability: 44.9267986|-1.5034091|43.8576896|1.7236353|0.7673597|27.8422983 unknown
InChI: InChI=1S/C3H6O2/c1-3(5)2-4/h4H,2H2,1H3
charge 0 multiplicity 1
11 atoms
O  -2.020585 -0.096163 -0.218118
O  0.2712 1.28796 0.019582
C  -0.794214 -0.857364 -0.22842
C  0.435175 0.037249 -0.047885
C  1.792968 -0.625945 0.063923
H  -0.807321 -1.617134 0.581681
H  -0.683794 -1.404922 -1.190477
H  2.561415 -0.010423 -0.432029
H  2.070333 -0.701113 1.133316
H  1.793047 -1.644602 -0.35991
H  -1.758724 0.866759 -0.150365
