program: Gaussian 09
title: 000085803
version: EM64L-G09RevD.01
frameworkgroup: C1[X(C9H14O2)]
method: RPBEPBE
basis: SDD
operation: Freq
keyword: #pfreq=noraman
keyword: PBEPBE/SDD
title: #p freq=noraman PBEPBE/SDD
converged: YES YES NO NO
title: Mulliken charges:
elementType: O O C C C C C C C C C H H H H H H H H H H H H H H
charge: -0.273366 -0.242125 -0.205024 -0.419383 -0.458567 -0.447187 -0.185659 -0.196887 0.228427 -0.225048 -0.674585 0.241073 0.227060 0.205759 0.214176 0.247351 0.227061 0.208771 0.201046 0.202809 0.226274 0.228639 0.212152 0.228103 0.229128
chargesum: 0.00000
title: Mulliken charges with hydrogens summed into heavy atoms:
elementType: O O C C C C C C C C C
charge: -0.273366 -0.242125 0.036049 0.013437 0.002961 -0.011354 0.015387 0.005922 0.228427 0.229866 -0.005203
polarizability: 1.08810194e+02 8.29029696e+00 1.01091168e+02 2.05971672e-01 -1.57799684e+00 8.27259109e+01
1716.lowfreq: -19.0858 -6.8943 -0.0010 -0.0004 0.0006 14.1068 31.3499 59.3806 75.8247
frequency: 27.5156 59.3703 75.8111 105.6824 138.0588 179.6406 248.3105 284.3061 302.6208 347.3292 381.8681 419.2631 501.2496 530.5683 552.0807 652.6064 703.8367 775.3219 798.1873 802.0779 820.7174 864.2237 898.5538 914.5121 953.6626 973.1356 977.3876 1023.1188 1042.6149 1068.2925 1106.5890 1111.4181 1125.4658 1135.3528 1140.4921 1180.1670 1200.1709 1238.5981 1248.2131 1273.7137 1311.0755 1331.9739 1344.1922 1353.2461 1356.8228 1383.1112 1399.6119 1447.8798 1460.3306 1463.1064 1467.1522 1474.4252 1486.8750 1624.6889 1677.3664 2961.1717 2963.0158 2976.4969 2994.7971 2995.6266 3009.3958 3016.1732 3033.2200 3067.1011 3074.6324 3091.2145 3093.9933 3106.0060 3126.3188
redmass: 3.8265 3.2532 3.1768 2.7193 2.4767 2.3988 1.3266 2.7595 3.0893 3.1920 2.0303 3.2794 5.4669 4.4026 3.6416 1.4569 2.5720 2.2865 1.2503 2.2582 3.8215 3.1037 2.6004 2.3323 2.5360 1.2290 2.3472 2.2967 2.2256 1.6792 1.8867 1.9229 2.0169 1.4661 1.3295 1.2351 1.1177 1.2911 1.1366 1.5069 1.7464 1.3979 1.4529 1.5893 1.4375 1.5884 1.2655 1.0931 1.0767 1.0406 1.0939 1.0586 1.0703 11.0251 6.3730 1.0667 1.0693 1.0716 1.0361 1.0741 1.0583 1.0886 1.0948 1.1064 1.0989 1.0985 1.0839 1.1025 1.0993
irintensity: 0.6056 0.5538 0.1064 0.8089 3.5897 3.1607 0.8302 5.0241 2.1401 11.4432 2.4173 0.9368 3.8040 2.8104 2.3462 49.2127 13.3102 3.1592 5.9912 4.2012 2.9836 6.6672 14.7614 10.2388 3.3543 0.8143 2.6692 37.1987 78.8456 20.9059 11.3316 20.4412 161.4926 5.7997 80.6727 40.6030 6.0896 2.4021 0.1213 2.6603 17.8799 2.5601 3.1803 2.9065 0.2038 0.4582 22.3835 16.9428 18.9385 11.8968 8.2107 3.9231 13.2401 157.0656 5.3334 16.4514 40.9880 31.7711 21.2161 24.8081 21.2650 61.9666 9.2136 7.4945 31.3402 30.9393 9.1447 44.8341 58.0973
temp: 298.150 k
press: 1.00000 atm
elementType: 8 8 6 6 6 6 6 6 6 6 6 1 1 1 1 1 1 1 1 1 1 1 1 1 1
symmnumber: 1
zpe: 557897.2 jmol-1
zpe.correction: 0.212492 hartree
zpe.thermalcorrener: 0.223965 hartree
zpe.thermalcorrenthalpy: 0.224909 hartree
zpe.thermalcorrgfe: 0.174021 hartree
zpe.sumelectzpe: -500.929595 hartree
zpe.sumelectthermal: -500.918122 hartree
zpe.sumelectthermalent: -500.917178 hartree
zpe.sumelectthermalfe: -500.968066 hartree
dipole: 0.9791 1.6233 0.9587
dipole: 2.1243
quadrupole: -58.5617 -70.0302 -65.1838
quadrupole: 1.5082 -1.5047 -3.7846
quadrupole: 6.0302 -5.4383 -0.5919 1.5082 -1.5047 -3.7846
hfenergy: -501.142087 hartree
pointgroup: C01 [X(C9H14O2)]
dipole: -0.3678671 0.7228348 -0.2017224 debye
dipolederiv: -1.4139868 0.3809101 0.2585161 0.4217618 -0.6446128 -0.0366315 0.3262955 -0.0242061 -0.3591093 -0.6269418 -0.1276266 0.1073414 0.2208883 -0.8865571 0.0750171 0.0749789 0.2505124 -0.3717932 -0.0655512 -0.0183229 0.0799442 -0.0190186 -0.0514718 0.0235243 0.1890843 0.0849578 0.017874 0.0931681 0.0227816 -0.0133555 0.0835319 0.0567883 -0.0405669 -0.013763 -0.0198954 0.0798642 0.0879081 0.0528264 -0.05888 -0.0528609 -0.0078808 -0.0178223 -0.0876922 -0.0605038 0.0436622 0.0691104 0.1094495 -0.0813469 0.0763205 0.0545398 -0.0054149 -0.0640705 -0.0632564 0.0358906 -0.0719652 -0.0363005 0.1833591 -0.0456081 -0.0039364 0.0705089 0.2062915 0.1084664 0.0530395 -0.0091867 -0.1848477 0.1262562 -0.159274 0.0012226 0.0364529 0.1543112 0.0331632 -0.0492397 1.3392639 -0.165973 -0.3145549 -0.5855126 1.1506559 -0.0778836 -0.3592708 -0.2994621 0.3585161 0.8350658 -0.0872355 -0.1343756 0.028833 0.2483912 0.0260514 -0.2138879 0.0642574 0.3870818 -0.0726693 0.0889969 0.0204156 0.0833301 -0.0255419 -0.0131738 0.0363455 -0.0130202 0.0564207 -0.0099633 -0.0335037 -0.0573464 -0.0349621 0.0627578 -0.0355087 -0.075118 -0.0408464 -0.1043352 -0.0346267 0.1261779 -0.0853121 0.1149754 -0.0061873 0.0258994 -0.068943 0.0163328 0.0447911 -0.0692116 -0.0966145 0.1350243 -0.0742305 0.0327711 0.0162638 0.0910218 0.0338593 -0.0551342 -0.0614157 -0.0057884 0.0839931 -0.0014889 0.1066155 0.0246023 0.0980226 -0.0589824 -0.1250631 0.1187151 -0.0669061 -0.0536617 -0.0083107 -0.0935082 -0.0086283 -0.040592 0.0183387 0.0714824 -0.0777392 0.0784221 0.1270849 0.0246582 0.0660658 0.0177091 0.0953589 0.034718 -0.0273068 0.0274807 -0.0917908 -0.0299657 -0.0726852 -0.1739023 -0.0384278 -0.052799 -0.0004003 0.0706761 -0.0317445 0.1058172 -0.1097493 0.129465 -0.0025124 0.025821 -0.1309608 0.0199472 0.0536659 0.0214834 0.0152243 -0.1463164 0.007986 0.0602166 -0.0564975 -0.1621589 -0.0498664 -0.0714314 -0.0557289 -0.0119424 0.013675 -0.0977025 -0.0599425 -0.0631639 0.0016264 -0.1001899 0.0057469 -0.0466953 0.0506041 -0.0536373 -0.0093979 0.0472106 0.0596036 0.0224181 0.0463435 -0.103721 -0.1181917 -0.0238708 0.104362 -0.0444329 0.0687354 0.0382436 0.1171755 0.0269126 0.0549144 0.0706267 -0.0946522 -0.0678311 -0.0342009 -0.0592593 -0.087671 -0.0629148 -0.0832662 0.043471 0.1027955 0.0141652 -0.0336392 0.0479355 0.0593422 0.0416927 -0.0807592 0.0760864 -0.1099631 unknown
polarizability: 107.8191306|-8.1331876|100.1981315|-2.9071924|6.0206524|84.6100107 unknown
InChI: InChI=1S/C9H14O2/c1-2-11-9(10)8-6-4-3-5-7-8/h3-4,8H,2,5-7H2,1H3
charge 0 multiplicity 1
25 atoms
O  -1.637317 0.134609 -0.263588
O  -0.751531 -1.987782 0.06081
C  0.563876 -0.292857 -1.198356
C  0.840854 1.217231 -0.96766
C  1.832194 -1.138543 -0.91524
C  1.283369 1.499111 0.486793
C  2.573789 -0.673763 0.326245
C  2.319541 0.497805 0.966809
C  -0.628368 -0.825904 -0.392404
C  -2.879068 -0.310938 0.441375
C  -3.831509 0.88039 0.450947
H  0.272616 -0.43426 -2.261044
H  -0.052404 1.81343 -1.219719
H  1.653593 1.514863 -1.65868
H  2.508642 -1.092832 -1.793724
H  1.542524 -2.199676 -0.796758
H  0.400397 1.479229 1.159775
H  1.693148 2.526159 0.558904
H  3.348069 -1.348491 0.716891
H  2.878883 0.748319 1.87906
H  -3.292115 -1.18205 -0.099028
H  -2.600526 -0.641459 1.458396
H  -4.771073 0.604449 0.963737
H  -3.385253 1.738392 0.982471
H  -4.077333 1.197468 -0.57701
