program: Gaussian 09
title: 000085930
version: EM64L-G09RevD.01
frameworkgroup: C1[X(C21H18N4O2)]
method: RPBEPBE
basis: SDD
operation: Freq
keyword: #p
keyword: freq=noraman
keyword: PBEPBE/SDD
title: #p freq=noraman PBEPBE/SDD
converged: YES YES NO NO
title: Mulliken charges:
elementType: O O N N N N C C C C C C C C C C C C C C C C C C C C C H H H H H H H H H H H H H H H H H H
charge: -0.237436 -0.243931 -0.245471 -0.331178 -0.312049 -0.037018 -0.046215 0.279529 0.020979 0.118468 -0.198149 0.069685 0.455526 0.102104 -0.778205 0.428161 -0.764304 -0.348463 -0.416154 -0.354470 -0.400717 -0.213572 -0.200552 -0.248589 -0.223900 -0.205058 -0.253452 0.276127 0.320006 0.241568 0.246463 0.282942 0.231713 0.243181 0.253940 0.304058 0.234818 0.300780 0.277100 0.234193 0.230700 0.235096 0.223981 0.222596 0.225169
chargesum: 0.00000
title: Mulliken charges with hydrogens summed into heavy atoms:
elementType: O O N N N N C C C C C C C C C C C C C C C C C C C C C
charge: -0.237436 -0.243931 -0.245471 -0.011172 -0.312049 -0.037018 -0.046215 0.279529 0.020979 0.118468 0.077978 0.069685 0.455526 0.102104 -0.007232 0.428161 -0.035470 -0.044405 -0.181336 -0.053690 -0.123617 0.020621 0.030148 -0.013493 0.000081 0.017539 -0.028283
polarizability: 5.61335333e+02 -1.12007570e+01 2.46232626e+02 2.33484504e+00 -6.45771231e+00 1.36610293e+02
1716.lowfreq: -14.7310 -4.0678 -0.0006 0.0006 0.0012 2.9086 16.6726 19.1439 32.4359
frequency: 16.2438 19.1108 32.4008 45.7981 53.5233 61.5558 82.6912 85.1680 108.3463 119.5493 130.7096 148.6350 166.6329 187.0546 217.8986 227.1222 233.8834 274.8154 285.3195 300.6151 310.1114 336.1600 349.2679 352.9458 369.4147 392.0232 404.2785 410.2076 421.2929 467.9465 502.4702 518.2366 557.9006 569.8881 579.2992 613.0602 614.3264 620.7027 630.8275 643.8078 660.5215 692.7157 701.2249 703.7044 714.1860 731.5486 760.2135 766.3800 770.1291 778.5923 822.9434 835.8676 855.7780 857.1161 908.2306 925.1264 930.0441 970.5758 983.7015 984.9283 986.1253 990.6012 996.4352 996.6955 997.6938 1005.2771 1018.2657 1030.4363 1035.5496 1041.3898 1043.3365 1048.2063 1084.4172 1093.1249 1095.9828 1137.4673 1170.4113 1172.4457 1176.3349 1186.7717 1194.9371 1265.2462 1279.1081 1291.2743 1322.5502 1330.1669 1341.4377 1361.9498 1381.5386 1383.3643 1395.4315 1405.9916 1410.9433 1446.6959 1448.2924 1450.6701 1453.3236 1461.3315 1473.8108 1482.3197 1488.0149 1493.0592 1510.0764 1582.3549 1588.4851 1590.5081 1599.8322 1611.1100 1612.4251 1632.6815 1654.6016 2984.0227 2992.2134 3058.4691 3071.3737 3074.9031 3104.1047 3119.8265 3126.4087 3130.8117 3138.1272 3141.3022 3152.2896 3159.1350 3169.6663 3184.4835 3187.0682 3190.9583 3523.2476
redmass: 5.9230 4.9028 4.0298 3.8382 5.2132 1.5167 5.1603 3.6063 4.8164 2.6911 1.7120 2.6016 4.6216 4.0257 4.0233 3.8938 4.4920 4.2164 7.1287 5.8810 5.8986 4.9341 3.9725 5.3198 5.5325 4.3963 2.8449 2.9875 3.8483 1.3914 3.1579 3.2921 6.2475 4.7831 5.6733 6.2948 6.4333 5.9846 6.7482 6.2560 6.6709 2.2720 2.0686 4.7806 7.8934 5.0474 2.0423 3.0575 1.8816 7.5866 6.1869 1.2690 1.2488 3.5263 1.4178 2.0613 1.4221 1.3669 5.1409 5.8686 1.3535 1.6006 1.9456 1.3757 1.2995 4.2168 3.6892 2.0756 2.0860 1.5876 2.2983 2.3439 2.1501 2.8615 1.7854 4.7774 1.0610 3.6697 1.1014 1.1342 1.1389 1.8985 4.8091 1.8818 1.3886 1.3434 3.3546 3.2159 6.6531 8.6964 1.3744 1.4069 2.0313 2.1302 2.4347 1.3370 1.4582 1.2369 1.2068 1.5692 2.4119 2.4292 3.0396 5.9542 6.7945 6.4483 10.3955 6.0234 6.0554 11.7095 9.6546 1.0398 1.0364 1.0971 1.0869 1.0972 1.0991 1.0971 1.0851 1.0856 1.0908 1.0886 1.0944 1.0974 1.0995 1.0939 1.0963 1.0963 1.0802
irintensity: 0.3068 0.3668 0.4772 1.8583 1.0232 1.3141 3.0110 0.6593 0.2981 0.1371 0.1749 2.8599 0.7433 1.0760 2.5954 3.2792 2.6913 2.0236 7.1905 1.9824 28.2119 1.3176 7.9923 2.2049 1.8404 16.3556 9.9706 0.0052 21.8630 315.5628 25.1433 14.6594 1.3978 39.7726 22.4652 1.5739 0.0723 47.0133 5.9941 0.5508 28.6570 24.9533 41.8135 25.3118 10.3694 19.4273 47.1734 78.9461 59.6226 87.0255 18.2277 1.9170 0.2007 30.1117 10.0504 72.4907 11.1851 0.8539 0.1821 1.8189 0.1470 31.2625 12.3625 1.0977 2.7495 26.0805 9.8226 7.7824 7.2230 6.5692 12.9796 30.6359 17.0986 43.6447 23.9989 118.7285 0.1301 19.7361 3.1890 3.2172 0.3191 84.4356 23.7775 39.4267 17.3588 9.1813 440.7050 82.0379 0.3679 1.3655 11.0724 31.4294 32.3231 21.4903 7.6134 19.7120 54.9454 10.8715 72.5482 60.8911 356.3655 23.5274 37.3710 185.0339 6.7232 3.8345 146.2106 140.7117 121.8869 354.5318 292.3659 19.7232 19.7323 15.4274 0.4847 15.4377 10.2517 2.4192 0.9685 9.6614 25.7833 4.6283 26.8292 44.5811 22.0696 2.6202 13.4108 7.9830 89.5491
temp: 298.150 k
press: 1.00000 atm
elementType: 8 8 7 7 7 7 6 6 6 6 6 6 6 6 6 6 6 6 6 6 6 6 6 6 6 6 6 1 1 1 1 1 1 1 1 1 1 1 1 1 1 1 1 1 1
symmnumber: 1
zpe: 906611.9 jmol-1
zpe.correction: 0.345310 hartree
zpe.thermalcorrener: 0.369020 hartree
zpe.thermalcorrenthalpy: 0.369964 hartree
zpe.thermalcorrgfe: 0.289618 hartree
zpe.sumelectzpe: -1178.580092 hartree
zpe.sumelectthermal: -1178.556383 hartree
zpe.sumelectthermalent: -1178.555438 hartree
zpe.sumelectthermalfe: -1178.635784 hartree
dipole: -6.8740 6.8193 2.3695
dipole: 9.9684
quadrupole: -134.0614 -152.4808 -158.2276
quadrupole: -8.4714 -7.1288 3.7061
quadrupole: 14.1952 -4.2242 -9.9710 -8.4714 -7.1288 3.7061
hfenergy: -1178.9254023 hartree
pointgroup: C01 [X(C21H18N4O2)]
dipole: -2.7906851 2.3688901 -1.4076431 debye
polarizability: 561.7159941|1.9533728|174.8024352|3.0634088|-52.4676254|207.6598217 unknown
InChI: InChI=1S/C21H18N4O2/c1-14-18(20(26)24(22-14)16-9-5-3-6-10-16)13-19-15(2)23-25(21(19)27)17-11-7-4-8-12-17/h3-13,22H,1-2H3
charge 0 multiplicity 1
45 atoms
O  -2.537765 -1.763275 1.313773
O  2.686043 -0.600328 1.984401
N  -3.64438 0.093008 0.274361
N  -3.201296 1.288311 -0.33029
N  3.498794 -0.019143 -0.206853
N  2.923229 0.32178 -1.467227
C  -1.332289 0.196559 0.349364
C  -1.821733 1.381429 -0.226799
C  1.214103 0.038152 0.072151
C  -2.493048 -0.639784 0.73971
C  0.013103 -0.171636 0.719965
C  1.594869 0.382223 -1.303859
C  -5.014335 -0.289782 0.217693
C  2.507941 -0.253133 0.779946
C  -1.141757 2.679918 -0.548723
C  4.919229 -0.121983 -0.107941
C  0.721492 0.603179 -2.508463
C  -5.491771 -1.309936 1.083434
C  -5.900032 0.353556 -0.687352
C  5.532363 -0.49111 1.119447
C  5.716432 0.153329 -1.249816
C  -6.854917 -1.665598 1.039116
C  -7.263969 -0.008379 -0.705269
C  -7.750607 -1.015971 0.157575
C  6.939008 -0.57926 1.188673
C  7.120053 0.059133 -1.158561
C  7.742513 -0.306547 0.05801
H  0.096958 -0.712277 1.677552
H  -3.835432 2.091082 -0.306667
H  -1.576517 3.509733 0.04099
H  -1.237879 2.943525 -1.617406
H  -0.071326 2.616491 -0.303708
H  0.334081 1.635628 -2.564712
H  -0.145543 -0.08086 -2.496664
H  1.311242 0.417641 -3.421017
H  -4.795197 -1.81409 1.756492
H  -5.529862 1.093052 -1.40586
H  4.911418 -0.704364 1.992067
H  5.226664 0.431945 -2.185383
H  -7.218475 -2.45538 1.705203
H  -7.941709 0.489081 -1.407529
H  -8.808657 -1.296496 0.137279
H  7.406511 -0.865378 2.137625
H  7.729399 0.272177 -2.044276
H  8.83365 -0.378521 0.122449
