program: Gaussian 09
title: 000085786
version: EM64L-G09RevD.01
frameworkgroup: C1[X(C7H13ClO2)]
method: RPBEPBE
basis: SDD
operation: Freq
keyword: #p
keyword: freq=noraman
keyword: PBEPBE/SDD
title: #p freq=noraman PBEPBE/SDD
converged: YES YES NO NO
title: Mulliken charges:
elementType: Cl O O C C C C C C C H H H H H H H H H H H H H
charge: -0.055394 -0.257163 -0.218052 -0.352143 -0.341431 -0.342665 -0.492162 -0.696637 0.316622 -0.504102 0.246527 0.202480 0.227458 0.205231 0.189524 0.192082 0.308879 0.212562 0.214134 0.214837 0.238464 0.247781 0.243169
chargesum: 0.00000
title: Mulliken charges with hydrogens summed into heavy atoms:
elementType: Cl O O C C C C C C C
charge: -0.055394 -0.257163 -0.218052 0.096865 0.091258 0.038941 -0.183283 -0.055105 0.316622 0.225312
polarizability: 1.09284901e+02 -7.33259109e-01 8.88664244e+01 1.58218258e+00 -2.83929794e+00 7.67586909e+01
1716.lowfreq: -26.0699 -10.0965 -3.6932 -0.0018 0.0011 0.0015 25.0748 37.6311 54.9782
frequency: 24.7000 33.4071 54.9707 95.9018 105.4371 120.9802 133.0788 198.7036 218.6809 228.3726 262.0992 272.1678 326.0507 389.2675 499.3324 616.9377 669.4492 725.9483 734.8911 779.4239 827.5048 901.8694 918.8175 928.9937 979.4815 1060.0003 1091.7511 1101.6599 1114.2626 1122.4407 1139.8490 1151.1267 1190.7224 1218.1776 1265.7760 1283.3395 1292.8769 1323.8049 1345.7222 1366.2504 1385.2507 1423.0487 1442.2799 1453.6104 1462.1133 1470.0389 1474.2432 1480.0219 1490.8738 1645.2328 2956.1316 2959.8278 2973.1256 2998.4619 3006.6792 3007.1919 3021.8244 3065.6971 3072.0127 3077.0423 3094.7965 3110.2018 3154.7247
redmass: 5.6165 1.8551 3.0210 1.1929 3.2323 3.7954 2.4764 3.7751 1.3331 2.8471 4.8955 2.8878 5.0145 3.0003 5.7266 4.7222 4.9581 3.0798 1.3128 1.6082 2.4363 1.7660 5.0698 1.4071 3.2318 2.4438 1.9850 2.9996 1.2898 1.6920 2.1985 1.4800 1.3148 1.3597 1.3787 1.1800 1.0643 1.7000 1.5116 1.4782 1.2176 1.1864 1.0798 1.0495 1.0502 1.0613 1.0429 1.0655 1.0866 9.2540 1.0623 1.0593 1.0359 1.0713 1.0896 1.0296 1.0960 1.1007 1.0995 1.1018 1.0873 1.1047 1.1049
irintensity: 1.8129 0.3139 0.1819 0.5365 1.0850 1.6230 0.2872 3.4261 1.4381 6.2438 4.0667 2.2496 13.5171 0.9963 21.4337 18.6150 4.7206 9.4186 8.9555 4.5040 6.1684 12.3025 5.5306 13.4851 13.6908 1.9685 28.9590 171.8865 4.4464 38.6911 70.1303 26.0127 13.2437 5.3975 3.8061 5.2217 0.9168 17.4717 16.2116 1.2578 11.8504 13.8951 7.8511 16.5692 12.0139 0.6657 12.5698 2.0616 19.4499 166.8645 4.0943 54.8132 31.9694 19.0649 27.3581 26.2076 11.1335 11.0861 52.3970 74.3546 5.9511 23.2186 14.6560
temp: 298.150 k
press: 1.00000 atm
elementType: 17 8 8 6 6 6 6 6 6 6 1 1 1 1 1 1 1 1 1 1 1 1 1
symmnumber: 1
zpe: 498475.9 jmol-1
zpe.correction: 0.189859 hartree
zpe.thermalcorrener: 0.202730 hartree
zpe.thermalcorrenthalpy: 0.203674 hartree
zpe.thermalcorrgfe: 0.148193 hartree
zpe.sumelectzpe: -884.232457 hartree
zpe.sumelectthermal: -884.219586 hartree
zpe.sumelectthermalent: -884.218642 hartree
zpe.sumelectthermalfe: -884.274124 hartree
dipole: 1.1063 -1.0854 1.8538
dipole: 2.4163
quadrupole: -58.0673 -71.9632 -67.4847
quadrupole: -5.6128 -1.4427 -0.4908
quadrupole: 7.7711 -6.1248 -1.6463 -5.6128 -1.4427 -0.4908
hfenergy: -884.4223165 hartree
pointgroup: C01 [X(C7H13Cl1O2)]
dipole: -0.3422634 -0.5267043 -0.7135845 debye
dipolederiv: -0.2667829 0.0277142 0.057545 0.0615186 -0.4937195 -0.1177478 0.100839 -0.1573871 -0.2640011 -1.4116437 -0.3267454 -0.1418328 -0.2461658 -0.4746892 0.0666928 -0.1928953 0.0538872 -0.3819186 -0.768112 -0.1023794 -0.0532076 0.1978045 -0.5672389 0.2422012 -0.312926 0.2177174 -0.4847294 -0.051783 0.0119675 0.0026395 0.0094183 0.1229293 0.0274768 0.0288224 0.0093636 -0.0014739 -0.060641 0.0538526 -0.0256004 0.0821699 -0.0103941 -0.039155 0.0739209 -0.0538054 0.0457644 0.0905394 0.0194689 -0.0279666 0.0076685 0.1918944 -0.0021305 -0.078869 0.0108395 0.0991953 0.2405367 -0.1781802 -0.1186503 -0.180368 0.4343905 0.2520562 -0.1847316 0.3250679 0.3296712 -0.0363355 0.0205686 -0.0650491 0.0231287 0.0840003 0.0137248 -0.0338571 0.0085838 0.0177485 1.6108795 0.3534909 0.3107403 0.014275 0.7113454 -0.3348516 0.6025028 -0.3343797 0.4358579 0.5115255 0.139218 -0.0314648 0.2116232 0.3565714 0.0116399 -0.1142395 -0.0211414 0.2542619 0.1054943 -0.0234898 0.0282422 -0.0274466 -0.0179991 0.083294 0.0346256 0.0691988 0.0074965 0.0621826 0.0152937 0.0014947 0.0026476 -0.0568346 -0.1123049 -0.0080113 -0.0831908 -0.0065698 -0.0053922 -0.0676573 0.0603873 -0.0557494 -0.0289608 0.1246082 0.0043058 0.088089 -0.0003344 0.0377826 0.0531799 0.023717 -0.0110347 -0.0477071 -0.1320106 -0.0329718 -0.0946312 0.0029152 0.0044632 -0.0289891 0.0207103 -0.0691295 -0.0835492 0.1460893 0.0528871 0.1189182 -0.0514811 0.0293581 -0.0101538 -0.0267543 0.0287611 -0.0960205 -0.1433608 0.0062671 -0.1273508 -0.0537937 -0.0149475 0.0293175 -0.0583118 0.0313108 0.008933 -0.019189 -0.0297455 -0.0165508 -0.0272256 0.0948598 0.0287295 0.0075209 -0.0121688 -0.092454 -0.1400464 -0.0332455 -0.1027498 -0.0189925 -0.2235523 0.0540148 0.027016 0.0556998 0.0905919 -0.0048439 0.0580412 -0.0100107 0.056384 0.0710189 -0.0839638 0.0529895 -0.0459447 -0.0669204 0.1272886 0.004233 0.1059647 -0.015576 -0.0906742 -0.0177068 -0.0649941 0.0184601 0.0962291 0.0321877 -0.0924873 0.0207376 0.0695227 0.0508094 -0.0415558 -0.0155463 -0.0618801 0.0439103 -0.0514867 0.0845619 -0.0103421 -0.0951705 0.0204144 0.0740057 0.0363755 -0.0345986 -0.1043082 -0.0301325 0.0629731 -0.0168277 0.082449 unknown
polarizability: 108.6385974|2.6194872|89.6051347|3.3925345|2.0792544|76.6662839 unknown
InChI: InChI=1S/C7H13ClO2/c1-3-4-5-6(8)7(9)10-2/h6H,3-5H2,1-2H3
charge 0 multiplicity 1
23 atoms
Cl -0.821147 2.024544 0.271548
O  -2.68669 -0.651785 -0.576998
O  -0.921895 -1.477706 0.699207
C  1.803724 0.014782 0.153491
C  0.891589 0.201743 -1.079487
C  3.27262 -0.230646 -0.261249
C  -0.595538 0.466801 -0.825885
C  4.210607 -0.39803 0.953156
C  -1.365547 -0.6540 -0.130225
C  -3.581141 -1.652077 0.057546
H  1.437901 -0.829189 0.76464
H  1.745442 0.920566 0.787735
H  1.276114 1.037663 -1.696403
H  0.946095 -0.708933 -1.715643
H  3.626221 0.61394 -0.888457
H  3.329402 -1.137602 -0.898219
H  -1.12718 0.745976 -1.74767
H  4.200134 0.506712 1.589723
H  5.254654 -0.577266 0.636771
H  3.895281 -1.25196 1.581634
H  -4.555574 -1.503087 -0.427057
H  -3.642394 -1.466442 1.142858
H  -3.19798 -2.671504 -0.116416
