program: Gaussian 09
title: 000085765
version: EM64L-G09RevD.01
frameworkgroup: C1[X(C8H7ClO3)]
method: RPBEPBE
basis: SDD
operation: Freq
keyword: #p
keyword: freq=noraman
keyword: PBEPBE/SDD
title: #p freq=noraman PBEPBE/SDD
converged: YES YES NO NO
title: Mulliken charges:
elementType: Cl O O O C C C C C C C C H H H H H H H
charge: -0.048815 -0.192589 -0.146202 -0.143621 -0.240628 -0.293016 -0.454404 -0.452258 0.173841 0.177277 -0.073479 -0.181717 0.295683 0.297775 0.249367 0.282290 0.248379 0.250046 0.252072
chargesum: 0.00000
title: Mulliken charges with hydrogens summed into heavy atoms:
elementType: Cl O O O C C C C C C C C
charge: -0.048815 -0.192589 -0.146202 -0.143621 0.055055 0.004759 0.077252 0.046166 0.173841 0.177277 -0.073479 0.070355
polarizability: 1.21649144e+02 1.52755041e+01 1.00125864e+02 1.70849005e+00 2.78154234e+00 6.53455610e+01
1716.lowfreq: -7.7090 -0.0023 -0.0021 -0.0009 3.0285 9.9102 44.3781 73.5932 138.1224
frequency: 44.3006 73.5894 138.1219 168.7759 227.1656 227.5607 264.6714 309.4507 379.6359 397.0560 464.8886 508.5453 558.2131 571.0261 610.4862 676.1667 714.9960 724.6106 797.2681 803.9617 830.7854 885.5271 929.4910 958.8625 975.2358 999.2457 1036.9707 1102.3437 1110.2404 1142.9649 1174.3276 1208.8869 1225.3196 1268.7005 1285.3794 1289.8440 1320.5939 1330.2665 1354.4623 1466.7464 1470.0324 1696.0654 1707.6274 1776.0360 2970.8390 2980.8001 2994.2030 3043.1115 3050.8105 3081.9113 3155.9581
redmass: 5.4269 5.4336 14.5645 6.8799 3.4955 3.3105 6.0468 5.8451 10.4349 2.5855 6.6590 6.0228 5.7822 7.6582 5.5825 8.2783 4.6277 4.4548 2.3038 4.7635 1.8960 3.7608 3.2083 2.1648 3.3226 2.6413 2.4187 1.9723 7.6033 2.1626 1.2923 1.1271 1.3540 1.3475 1.5028 1.3163 1.3970 1.6235 1.6529 1.0849 1.0804 7.3774 12.6547 12.5937 1.0675 1.0794 1.0648 1.0988 1.0929 1.0880 1.0928
irintensity: 4.2458 0.7940 3.9775 5.1342 2.5096 2.1145 2.7801 1.4554 11.7097 9.3314 3.4170 1.9407 56.4853 5.8026 1.0460 9.0041 6.0538 10.1012 29.1091 245.7822 17.4924 20.0347 23.0316 23.6354 108.8893 3.0705 47.2699 10.6047 138.5714 2.4240 3.1577 5.7334 0.8185 4.5444 4.7892 1.7741 4.6049 9.6045 22.3855 18.8965 11.4912 11.6980 489.2415 101.2040 15.3056 9.5827 8.4618 5.2725 8.6063 8.3810 3.2668
temp: 298.150 k
press: 1.00000 atm
elementType: 17 8 8 8 6 6 6 6 6 6 6 6 1 1 1 1 1 1 1
symmnumber: 1
zpe: 355793.8 jmol-1
zpe.correction: 0.135515 hartree
zpe.thermalcorrener: 0.145814 hartree
zpe.thermalcorrenthalpy: 0.146759 hartree
zpe.thermalcorrgfe: 0.098526 hartree
zpe.sumelectzpe: -993.895939 hartree
zpe.sumelectthermal: -993.885640 hartree
zpe.sumelectthermalent: -993.884695 hartree
zpe.sumelectthermalfe: -993.932928 hartree
dipole: 2.2816 -1.9927 2.2707
dipole: 3.7859
quadrupole: -98.4451 -80.3144 -72.0611
quadrupole: -0.8204 -2.9791 6.5534
quadrupole: -14.8383 3.2925 11.5458 -0.8204 -2.9791 6.5534
hfenergy: -994.031454 hartree
pointgroup: C01 [X(C8H7Cl1O3)]
dipole: -0.8453268 0.8431096 0.8905743 debye
dipolederiv: -0.8498477 -0.0732157 0.0264436 -0.0232647 -0.1556995 0.0485534 -0.0099488 0.0475904 -0.1000271 -0.9186889 -0.5357416 0.0130881 -0.5303379 -1.3806555 -0.2218118 0.0973795 -0.2632987 -0.2928416 -0.4966514 -0.1332378 0.0179499 -0.1522127 -0.9810138 -0.2125341 0.0236751 -0.3112441 -0.4035803 -0.9438651 -0.3824282 -0.0434794 -0.3457874 -0.7204133 -0.0914108 0.0527646 -0.0568507 -0.3060051 -0.0387943 -0.0127492 0.1069622 0.1472711 -0.111181 -0.1072111 0.1931829 -0.1484136 -0.0485593 -0.3765157 0.0833402 0.0858664 0.0510666 0.0109471 0.0150847 -0.0069269 0.0180636 0.1024453 -0.1051402 -0.0336724 -0.0322551 -0.0001399 -0.0645064 0.0690521 -0.0414026 0.0685916 0.1309283 0.06522 0.016249 -0.0226289 -0.0857725 0.1423078 0.0365949 0.192345 0.0328145 0.1051517 1.1477428 0.6939254 -0.1087428 0.299727 1.4040887 0.3674541 -0.3610455 0.3660337 0.5065733 1.3418466 0.2567462 -0.0423416 0.5677092 1.6026002 0.3222574 -0.0348811 0.4534658 0.3213852 1.1399476 0.1024861 -0.0075243 0.0779656 0.2812127 -0.2279624 0.0342439 -0.2030335 -0.0146131 -0.1400779 -0.0379808 -0.0002484 -0.0385787 -0.2097907 0.0086477 -0.0574563 -0.0371881 -0.1642041 0.0200559 0.0323101 -0.0499177 0.0433998 0.0475872 0.0317722 -0.061576 0.0531041 -0.0053865 0.0878746 0.0120622 0.0033645 -0.0107462 0.0099946 -0.057202 -0.0030954 -0.0580044 -0.0208575 0.0258147 0.0209239 0.0396418 0.0043582 0.0867075 0.0142301 0.0681362 0.0593591 -0.0698201 0.0958007 0.0110694 -0.0247873 -0.0567342 -0.005538 -0.0105459 -0.042291 -0.0484694 0.0744372 -0.0471368 -0.0264682 0.0877177 0.0418346 0.0757759 -0.0847364 0.0468937 -0.038152 -0.0423954 0.0061321 -0.0499402 -0.0068268 -0.0342019 -0.093636 0.0244284 -0.0406015 -0.0004402 0.0947104 -0.0137171 0.0563217 -0.0422818 0.044444 0.0612126 0.0753395 -0.0493958 0.0660718 0.1326586 unknown
polarizability: 122.6265682|14.2616904|98.8140596|-3.6608141|-4.049445|65.6799405 unknown
InChI: InChI=1S/C8H7ClO3/c9-4-1-2-5-6(3-4)8(11)12-7(5)10/h1,5-6H,2-3H2
charge 0 multiplicity 1
19 atoms
Cl -3.987439 0.189345 0.138485
O  2.152553 -0.744549 -0.349841
O  0.644335 -2.523178 -0.573591
O  3.06645 1.348923 0.17575
C  0.086849 -0.547886 0.879243
C  0.63688 0.877718 0.600861
C  -1.446468 -0.757989 0.812723
C  -0.094591 1.598163 -0.577098
C  0.900065 -1.421522 -0.087416
C  2.081871 0.61094 0.178209
C  -2.162562 0.366585 0.109229
C  -1.600467 1.431075 -0.501883
H  0.43497 -0.852425 1.887961
H  0.60813 1.521961 1.493448
H  -1.862794 -0.859769 1.831782
H  -1.65681 -1.717763 0.300818
H  0.2677 1.205922 -1.550263
H  0.173369 2.669368 -0.561097
H  -2.22474 2.186581 -0.990421
