program: Gaussian 09
title: 000085779
version: EM64L-G09RevD.01
frameworkgroup: C1[X(C16H34O)]
method: RPBEPBE
basis: SDD
operation: Freq
keyword: #pfreq=noraman
keyword: PBEPBE/SDD
title: #p freq=noraman PBEPBE/SDD
converged: YES YES NO NO
title: Mulliken charges:
elementType: O C C C C C C C C C C C C C C C C H H H H H H H H H H H H H H H H H H H H H H H H H H H H H H H H H H
charge: -0.463657 -0.386012 -0.386145 -0.386025 -0.385768 -0.386885 -0.384844 -0.382563 -0.381828 -0.371760 -0.372838 -0.386298 -0.353258 -0.033761 -0.356807 -0.718246 -0.696887 0.192546 0.194019 0.193417 0.192682 0.191744 0.193743 0.192791 0.193497 0.196625 0.191226 0.192407 0.192902 0.185523 0.195277 0.191344 0.191882 0.177049 0.235966 0.188976 0.189257 0.208539 0.187321 0.187542 0.187357 0.180440 0.194657 0.194652 0.231224 0.214257 0.205092 0.209546 0.214646 0.209607 0.335827
chargesum: 0.00000
title: Mulliken charges with hydrogens summed into heavy atoms:
elementType: O C C C C C C C C C C C C C C C C
charge: -0.127830 0.000553 -0.000046 -0.000539 0.000519 0.000967 0.000465 -0.001763 0.001398 0.041255 0.005395 0.009562 0.021640 0.146679 0.032503 -0.067672 -0.063088
polarizability: 2.42527460e+02 -4.89885571e-01 1.55176710e+02 7.17214382e-01 5.90827974e-01 1.46194925e+02
1716.lowfreq: -0.0019 -0.0004 0.0007 4.9928 9.4765 17.3394 23.1769 25.2969 37.5295
frequency: 17.5551 25.2848 37.0773 37.7451 56.2971 62.2571 64.1499 89.2410 93.4869 103.4633 116.6388 122.9185 133.9599 140.7845 149.3776 158.0321 161.8312 164.3800 223.8247 226.3472 235.2219 254.3659 296.4684 299.7444 350.4718 367.6613 417.5998 426.3045 464.4085 474.5398 500.9759 510.8763 720.6685 721.3833 723.5634 728.5124 738.6702 756.3711 782.7216 807.7338 828.9370 865.7482 888.8038 906.5468 917.4909 952.4172 975.8565 984.5309 989.4120 1000.2023 1016.1590 1024.1678 1029.3995 1038.4943 1052.4876 1065.9329 1072.7841 1076.6590 1080.9935 1081.7566 1083.4927 1084.8085 1111.8925 1127.9401 1134.3850 1179.6183 1194.7903 1200.9710 1214.6876 1224.6038 1234.2644 1246.4883 1251.5713 1266.1093 1268.6663 1278.7632 1280.5627 1283.8775 1287.2611 1290.3085 1292.3610 1294.8263 1298.4564 1299.0248 1308.0315 1320.4930 1332.9582 1346.2090 1355.2882 1356.6281 1358.7974 1360.6871 1361.6128 1383.2396 1385.8095 1390.6339 1445.2722 1459.1422 1459.2633 1461.7286 1461.9498 1464.4276 1464.9905 1468.1682 1468.9680 1470.2973 1472.3894 1476.4959 1476.9911 1480.8250 1484.4454 1487.1383 1488.6845 2923.2104 2947.8127 2948.2150 2948.7745 2949.5478 2950.4430 2951.1434 2952.9667 2956.0807 2959.1849 2961.6810 2964.5350 2968.2742 2970.0909 2971.6085 2973.9273 2981.0150 2982.6623 2985.4040 2989.4318 2994.8243 3001.8593 3010.4462 3019.0664 3024.1496 3029.4816 3036.8054 3042.7515 3054.6006 3061.5826 3067.9858 3070.1650 3082.9761 3556.8001
redmass: 3.9432 4.0862 2.4462 2.7680 3.7476 1.6622 3.1447 1.6026 3.1551 3.4856 1.6353 2.9271 3.7777 1.7257 2.3557 1.9580 3.1647 2.0796 1.8608 1.1376 1.4635 3.6204 1.2241 2.3290 3.4580 2.9399 3.2435 2.7882 2.4502 3.1652 2.7991 2.9902 1.0571 1.0627 1.0734 1.0950 1.1342 1.1958 1.3435 1.7739 1.3964 1.2602 1.8949 1.3657 1.6782 1.2535 5.6159 3.5630 1.3399 4.5908 1.2969 3.0816 3.3886 1.1089 3.0983 2.5353 2.6486 1.7329 2.1239 2.2111 2.1094 2.2868 2.4637 3.1749 1.6976 1.9258 1.6499 1.2680 1.4760 1.3022 1.3722 1.2915 1.3147 1.2596 1.2926 1.0136 1.1938 1.0469 1.1731 1.1485 1.1560 1.0957 1.1250 1.1105 1.3031 1.3089 1.3612 1.4214 1.5424 1.6820 1.6610 1.6099 1.6168 1.3794 1.4940 1.2188 1.0867 1.0752 1.0750 1.0731 1.0718 1.0628 1.0761 1.0818 1.0544 1.0671 1.0844 1.0720 1.0562 1.0900 1.0938 1.0964 1.0945 1.0837 1.0588 1.0586 1.0589 1.0589 1.0594 1.0595 1.0598 1.0603 1.0621 1.0615 1.0589 1.0583 1.0423 1.0369 1.0547 1.0959 1.0963 1.0971 1.0985 1.1002 1.1020 1.1031 1.1024 1.1000 1.1049 1.1048 1.1044 1.1019 1.0983 1.1006 1.0993 1.0997 1.0661
irintensity: 0.1580 0.1368 0.3683 0.5437 0.2387 0.0992 0.6304 0.1860 0.9380 0.3270 0.2709 0.6874 0.1213 0.2561 0.8257 0.1784 0.1724 0.3182 0.4929 0.0007 0.3921 0.5647 121.6723 25.9379 4.7736 0.8692 5.4836 2.2515 5.7636 1.1614 1.0550 0.2149 22.5987 0.2392 6.5888 0.4439 1.3034 2.1463 2.3217 12.7592 2.0496 0.2814 5.0514 9.0006 6.6937 0.3946 1.3366 0.1553 7.1792 2.8026 4.4348 5.2097 5.0628 1.5435 0.6857 10.5586 2.2228 42.4943 0.5664 4.0092 0.8843 0.3272 30.0124 5.4232 1.7674 0.0455 2.0368 28.7885 2.4933 1.3432 6.5575 3.2467 6.8542 3.2460 1.5605 0.1677 2.7465 0.5095 0.3025 0.3585 0.5721 0.9076 0.2093 0.1777 2.7945 6.2191 2.0067 0.8940 1.2457 0.1066 0.6460 0.1154 0.3833 33.1233 3.9269 11.2343 2.8279 0.0010 0.0125 0.0027 0.0457 0.0331 0.0455 0.1022 9.8803 7.2352 1.2176 4.3815 9.0857 1.2168 2.0409 8.2378 43.3864 54.7135 1.8103 0.0042 0.8069 0.0440 1.7677 0.0193 0.3066 4.7911 4.1928 2.5339 198.2032 199.6357 32.1391 35.5297 69.6108 0.7758 1.6935 2.2842 2.3577 2.0801 2.0245 3.7022 4.8248 13.6303 6.8724 0.1181 301.9789 113.9285 55.4642 99.2185 56.1858 46.5326 4.3405
temp: 298.150 k
press: 1.00000 atm
elementType: 8 6 6 6 6 6 6 6 6 6 6 6 6 6 6 6 6 1 1 1 1 1 1 1 1 1 1 1 1 1 1 1 1 1 1 1 1 1 1 1 1 1 1 1 1 1 1 1 1 1 1
symmnumber: 1
zpe: 1229656.4 jmol-1
zpe.correction: 0.468351 hartree
zpe.thermalcorrener: 0.491836 hartree
zpe.thermalcorrenthalpy: 0.492780 hartree
zpe.thermalcorrgfe: 0.412237 hartree
zpe.sumelectzpe: -703.874381 hartree
zpe.sumelectthermal: -703.850897 hartree
zpe.sumelectthermalent: -703.849953 hartree
zpe.sumelectthermalfe: -703.930495 hartree
dipole: 1.4567 -0.4080 1.1359
dipole: 1.8917
quadrupole: -91.9126 -111.4815 -111.0616
quadrupole: 0.1932 8.7365 0.0757
quadrupole: 12.9059 -6.6629 -6.2430 0.1932 8.7365 0.0757
hfenergy: -704.3427326 hartree
pointgroup: C01 [X(C16H34O1)]
dipole: 0.5729596 0.1635819 -0.4459519 debye
polarizability: 242.5258537|0.6525097|155.1732627|-0.6825712|0.6304369|146.1999783 unknown
InChI: InChI=1S/C16H34O/c1-3-4-5-6-7-8-9-10-11-12-13-14-15-16(2)17/h16-17H,3-15H2,1-2H3
charge 0 multiplicity 1
51 atoms
O  7.883347 -1.34517 0.706913
C  0.162094 -0.295683 -0.196883
C  -1.136493 0.471195 0.139995
C  1.446334 0.508902 0.104979
C  -2.420641 -0.333658 -0.161515
C  2.743941 -0.258423 -0.234302
C  -3.71918 0.433616 0.17467
C  4.029884 0.544539 0.06437
C  -5.003013 -0.371062 -0.1288
C  5.322532 -0.233156 -0.268015
C  -6.302224 0.397351 0.20244
C  6.604438 0.575921 0.023243
C  -7.585922 -0.406705 -0.102894
C  7.896817 -0.210562 -0.248763
C  -8.885201 0.363401 0.22654
C  9.167638 0.638972 -0.066287
C  -10.162414 -0.448447 -0.079674
H  0.151678 -0.57925 -1.270453
H  0.183698 -1.247374 0.374514
H  -1.125834 0.754918 1.213523
H  -1.158021 1.422934 -0.431552
H  1.42431 1.461551 -0.465108
H  1.457948 0.79069 1.17893
H  -2.431041 -0.617945 -1.234876
H  -2.399179 -1.284988 0.410546
H  2.767325 -1.209784 0.337175
H  2.730722 -0.542318 -1.307855
H  -3.739928 1.385704 -0.396232
H  -3.709562 0.716453 1.24838
H  4.009647 1.494812 -0.510608
H  4.041105 0.831082 1.137029
H  -5.010553 -0.657471 -1.201656
H  -4.983693 -1.321484 0.444923
H  5.307983 -0.524228 -1.340109
H  5.358695 -1.173087 0.314407
H  -6.320775 1.348538 -0.370165
H  -6.295517 0.682351 1.275699
H  6.613942 0.892859 1.085626
H  6.616633 1.497846 -0.59335
H  -7.569826 -1.357127 0.471049
H  -7.593622 -0.693331 -1.175717
H  7.865501 -0.609791 -1.288932
H  -8.875879 0.650595 1.298078
H  -8.901219 1.312007 -0.348329
H  9.221345 1.027632 0.966754
H  9.172802 1.497469 -0.763672
H  10.08235 0.045652 -0.260208
H  -10.211551 -0.720136 -1.15125
H  -11.076481 0.122878 0.16646
H  -10.183379 -1.388101 0.504326
H  8.710743 -1.876386 0.584136
