program: Gaussian 09
title: 000085807
version: EM64L-G09RevD.01
frameworkgroup: C1[X(C16H28O)]
method: RPBEPBE
basis: SDD
operation: Freq
keyword: #pfreq=noraman
keyword: PBEPBE/SDD
title: #p freq=noraman PBEPBE/SDD
converged: YES YES NO NO
title: Mulliken charges:
elementType: O C C C C C C C C C C C C C C C C H H H H H H H H H H H H H H H H H H H H H H H H H H H H
charge: -0.272044 -0.522923 -0.471510 0.420653 -0.532691 -0.304012 -0.471723 0.465047 -0.831400 -0.294751 -0.362746 -0.824899 0.404882 -0.325205 -0.789354 -0.791510 -0.498893 0.189913 0.215443 0.211385 0.211366 0.205365 0.220049 0.214273 0.205445 0.201853 0.226836 0.217792 0.224815 0.211415 0.239650 0.221058 0.232009 0.222860 0.191489 0.196395 0.218916 0.225627 0.213943 0.217026 0.217091 0.222858 0.197174 0.197582 0.233450
chargesum: 0.00000
title: Mulliken charges with hydrogens summed into heavy atoms:
elementType: O C C C C C C C C C C C C C C C C
charge: -0.272044 -0.117567 -0.048759 0.420653 -0.107277 -0.089738 -0.064425 0.465047 -0.161956 -0.083336 -0.123096 -0.148972 0.404882 0.062679 -0.130868 -0.134535 0.129314
polarizability: 2.33771580e+02 2.28700035e+01 1.64086185e+02 -4.11074318e+00 -4.83196360e+00 1.52323710e+02
1716.lowfreq: -14.4233 -9.0410 -6.8257 -0.0008 -0.0005 0.0004 7.3947 15.0694 25.5893
frequency: -6.5075 14.5829 24.2426 28.9460 34.2502 41.9821 52.7532 58.0973 79.2016 83.4062 102.1978 118.6570 140.8455 146.8294 174.4648 188.5626 211.4351 222.9383 267.2751 280.7293 294.4301 317.0332 343.8849 344.5401 369.4480 386.2205 413.1754 457.3770 472.3230 483.6290 503.3152 524.3657 552.4486 579.1663 732.0733 765.8744 786.1503 793.8625 834.6736 842.4891 853.0544 885.0137 896.5956 928.3907 947.8442 972.2392 974.3836 986.4972 987.3049 992.9678 999.2959 1012.5296 1036.7243 1041.0527 1042.9332 1049.7325 1080.7469 1084.7937 1110.0257 1114.7934 1123.3268 1145.7690 1151.8207 1158.9575 1179.4253 1202.6454 1220.0342 1227.0520 1235.2479 1258.6799 1271.0563 1295.5865 1318.5495 1325.2561 1331.8669 1356.8231 1363.4001 1378.2904 1387.4406 1393.7444 1395.3174 1397.1395 1433.3154 1451.7824 1454.0043 1454.5504 1456.4941 1460.4911 1461.4896 1465.8916 1469.6207 1469.8571 1471.0287 1472.4069 1473.3706 1481.2038 1482.0898 1482.4331 1687.6232 1692.6053 1696.9953 2888.9399 2916.7246 2955.0548 2955.6982 2958.6632 2959.8917 2960.6207 2961.3361 2967.1689 2971.6121 2977.6528 2986.0555 3021.8413 3024.8677 3025.5240 3026.9488 3028.6435 3039.3117 3042.5327 3046.5533 3067.7631 3070.4350 3078.4537 3082.5726 3088.9959 3091.5120 3099.2657 3105.4339
redmass: 3.1756 3.3192 2.9812 3.0355 2.5350 2.5361 2.5692 2.6078 2.4128 1.5662 1.8404 1.1745 1.3194 1.9823 2.8580 1.3369 1.2262 2.4090 2.6325 2.2846 2.7131 2.3284 2.6708 2.8892 2.4336 2.3268 2.3504 2.5070 2.5968 2.3830 2.4761 2.8171 2.2591 2.6911 2.0626 1.8850 1.9449 1.8722 1.3567 1.5625 2.4599 1.9436 2.5490 1.9114 1.3934 1.5363 1.7431 1.9561 2.2386 1.2897 2.6508 1.8069 1.5694 1.8727 3.2897 2.1326 1.6730 1.8522 1.4164 1.6228 2.3683 1.4684 1.5580 1.5277 1.1996 1.1723 1.7802 1.7485 1.9526 1.3808 1.1604 1.3531 1.4660 1.4471 1.2960 1.4127 1.4245 1.4239 1.3256 1.2856 1.2800 1.2396 1.1471 1.0716 1.0531 1.0642 1.0755 1.0699 1.0777 1.0746 1.0799 1.0522 1.0572 1.0684 1.0666 1.0812 1.0778 1.0774 6.9232 7.0957 6.5170 1.0622 1.0357 1.0450 1.0540 1.0547 1.0938 1.0389 1.0465 1.0388 1.0630 1.0633 1.1023 1.0956 1.0986 1.0970 1.0973 1.0963 1.0964 1.0951 1.0974 1.0922 1.0913 1.0965 1.0968 1.0952 1.0956 1.0964 1.0893
irintensity: 0.9874 0.1845 0.2367 0.0694 2.6176 0.9282 1.2926 1.2154 3.7840 1.2145 0.2398 0.4080 1.3715 0.8714 0.3906 0.8204 3.1990 0.8545 0.6096 0.4071 2.5924 0.1709 2.5545 1.5506 0.7319 1.2362 2.1945 7.0305 4.9786 4.7356 2.4365 7.4057 5.4176 6.5395 2.7226 3.9580 9.3264 0.2365 26.2990 8.7279 7.6648 4.2057 22.5259 2.1829 0.6641 0.0430 5.9769 10.3271 7.1041 2.8931 7.0193 5.8470 5.9469 20.0555 101.4535 15.2669 3.6527 42.0406 1.3964 7.1814 5.4421 9.1330 0.8701 7.2388 12.6615 1.2104 5.3491 6.8118 3.3121 6.9188 1.0137 0.5682 0.5678 0.2112 8.6119 0.4316 3.1527 17.8035 20.1155 4.7460 41.4154 12.9730 0.3590 3.1501 11.4283 1.0323 2.3446 2.1819 2.7808 7.4723 28.2871 7.8109 28.6556 21.9956 8.0186 11.8460 0.6345 21.6482 5.3152 14.7605 3.0395 50.7205 122.8177 15.8324 27.6178 31.9881 49.3881 55.9780 33.8572 34.5507 67.9097 89.3798 78.0009 2.2737 15.2979 0.7407 38.5051 65.0590 27.7762 24.8136 21.2970 5.4831 55.7170 61.6609 41.4922 34.7722 36.5944 33.6757 21.2513
temp: 298.150 k
press: 1.00000 atm
elementType: 8 6 6 6 6 6 6 6 6 6 6 6 6 6 6 6 6 1 1 1 1 1 1 1 1 1 1 1 1 1 1 1 1 1 1 1 1 1 1 1 1 1 1 1 1
symmnumber: 1
zpe: 1041346.6 jmol-1
zpe.correction: 0.396628 hartree
zpe.thermalcorrener: 0.418633 hartree
zpe.thermalcorrenthalpy: 0.419577 hartree
zpe.thermalcorrgfe: 0.341503 hartree
zpe.sumelectzpe: -700.279339 hartree
zpe.sumelectthermal: -700.257334 hartree
zpe.sumelectthermalent: -700.256389 hartree
zpe.sumelectthermalfe: -700.334463 hartree
dipole: 0.5090 -1.6410 0.7434
dipole: 1.8721
quadrupole: -94.9051 -108.9997 -105.0128
quadrupole: -4.5731 0.6201 -2.1313
quadrupole: 8.0675 -6.0272 -2.0403 -4.5731 0.6201 -2.1313
hfenergy: -700.6759668 hartree
pointgroup: C01 [X(C16H28O1)]
dipole: -0.251743 -0.6019018 -0.3417847 debye
polarizability: 229.99228|-26.8568615|166.5409509|-7.8466852|6.9521074|153.6482444 unknown
InChI: InChI=1S/C16H28O/c1-14(2)8-6-9-15(3)10-7-11-16(4)12-13-17-5/h8,10,12H,6-7,9,11,13H2,1-5H3
charge 0 multiplicity 1
45 atoms
O  -5.348515 1.44144 0.574868
C  3.733103 -1.453619 0.850336
C  -0.193711 -1.624287 0.318509
C  2.393093 -1.790327 0.202921
C  -0.892164 -0.254201 0.032465
C  1.225155 -1.434272 0.812678
C  4.451191 -0.21597 0.204791
C  -2.363495 -0.378096 -0.34503
C  2.485436 -2.51204 -1.131116
C  3.789975 1.098273 0.564973
C  -3.324629 0.148181 0.467089
C  -2.648096 -1.115605 -1.643355
C  3.039912 1.913675 -0.231235
C  -4.817299 0.095653 0.284591
C  2.425609 3.191984 0.318355
C  2.733219 1.646522 -1.694395
C  -6.808656 1.462211 0.564949
H  4.415445 -2.325797 0.771386
H  3.591446 -1.249932 1.929238
H  -0.220395 -2.253276 -0.589676
H  -0.789469 -2.15363 1.090645
H  -0.334233 0.244321 -0.788108
H  -0.78686 0.38771 0.928069
H  1.304708 -0.909366 1.778508
H  5.498059 -0.20567 0.571688
H  4.507496 -0.353152 -0.890649
H  2.951286 -3.509485 -1.002035
H  3.128775 -1.954921 -1.84078
H  1.505105 -2.658171 -1.613396
H  3.922373 1.402888 1.616106
H  -3.015288 0.666979 1.385744
H  -3.673202 -0.947226 -2.014105
H  -2.515961 -2.209056 -1.523999
H  -1.940429 -0.793029 -2.431231
H  -5.272242 -0.630431 1.000981
H  -5.108962 -0.217845 -0.741056
H  1.320195 3.167589 0.235243
H  2.685162 3.349012 1.379904
H  2.765871 4.078399 -0.253742
H  3.079656 2.4872 -2.32824
H  1.638329 1.56426 -1.84841
H  3.195318 0.719946 -2.071591
H  -7.219083 1.192467 -0.432688
H  -7.233799 0.766116 1.321273
H  -7.105231 2.493877 0.812223
