program: Gaussian 09
title: 000085755
version: EM64L-G09RevD.01
frameworkgroup: C1[X(C11H20O)]
method: RPBEPBE
basis: SDD
operation: Freq
keyword: #pfreq=noraman
keyword: PBEPBE/SDD
title: #p freq=noraman PBEPBE/SDD
converged: YES YES NO NO
title: Mulliken charges:
elementType: O C C C C C C C C C C C H H H H H H H H H H H H H H H H H H H H
charge: -0.314361 -0.054976 0.395054 -0.478375 -0.485377 -0.526386 0.433466 -0.411273 -0.777854 -0.779437 -0.826809 -0.528399 0.202762 0.200612 0.243033 0.247585 0.207929 0.203700 0.204657 0.201950 0.207866 0.218646 0.238471 0.207093 0.219577 0.247910 0.218276 0.225566 0.215664 0.229627 0.207112 0.206692
chargesum: 0.00000
title: Mulliken charges with hydrogens summed into heavy atoms:
elementType: O C C C C C C C C C C C
charge: -0.314361 0.147787 0.395054 -0.034731 -0.029863 -0.118029 0.433466 -0.209323 -0.112871 -0.104857 -0.167304 0.115032
polarizability: 1.45219013e+02 -6.81824968e+00 1.16028976e+02 -3.38608459e-01 -2.50359421e-01 9.90287490e+01
1716.lowfreq: -23.0302 -17.5986 -0.0007 -0.0007 -0.0002 7.3128 49.9644 64.5949 80.9448
frequency: 49.8038 64.5353 80.8549 141.3899 156.0341 172.7148 195.2502 214.2004 228.3183 245.7349 267.2904 302.1669 306.6632 326.1099 353.6613 383.6818 421.1301 462.2507 471.2690 501.8860 559.5816 633.7435 703.3950 758.9649 799.5610 803.3203 872.8076 907.1676 914.2371 922.3808 936.0066 960.5906 981.4831 1016.5048 1026.1651 1028.4525 1054.2684 1089.8444 1111.6178 1133.1425 1134.9633 1142.8388 1149.7337 1170.7170 1188.8935 1219.7725 1233.2171 1253.1011 1290.1782 1295.5595 1310.8155 1329.6848 1350.4386 1366.5656 1373.2933 1383.4426 1391.7702 1432.2303 1452.5980 1455.8913 1460.1949 1461.7226 1463.6232 1469.7278 1472.4308 1475.4115 1479.3731 1484.7132 1495.0087 1700.5085 2938.2040 2938.6370 2950.3694 2953.6961 2962.6900 2982.8166 2985.4893 2987.5353 3005.7566 3012.1028 3014.6225 3022.6517 3062.2834 3070.5802 3073.1782 3077.1048 3086.4648 3090.7440 3093.5287 3097.2337
redmass: 2.8567 2.9729 2.1245 1.3843 1.9343 1.1430 2.1368 1.5725 1.5655 1.2297 2.0987 2.6511 2.4873 2.4532 2.7960 2.2587 2.0303 3.0322 2.6214 3.4410 3.2250 3.3114 3.5839 2.7878 1.6158 1.3159 2.6236 1.4913 1.6881 1.7343 1.8301 2.0576 1.3542 7.5518 1.5430 1.5350 2.2054 1.9548 1.2672 2.4595 1.7275 1.2682 1.4203 2.3946 2.5233 1.5226 1.8733 1.6343 1.4195 1.3706 1.2854 1.4584 1.9333 1.2829 1.6287 1.2161 1.2418 1.1228 1.0640 1.0785 1.0756 1.0524 1.0595 1.0597 1.0632 1.0797 1.0514 1.0532 1.0571 6.4942 1.0415 1.0542 1.0819 1.0380 1.0588 1.0366 1.0893 1.0374 1.0649 1.0993 1.1016 1.0965 1.1023 1.0991 1.0981 1.0980 1.0906 1.0976 1.0993 1.0986
irintensity: 0.1761 0.5987 5.5820 0.2529 1.0935 0.7583 0.7730 0.1022 0.1722 1.8885 4.7450 0.3309 0.5564 0.4125 3.2720 3.8182 3.6725 2.7039 1.8077 0.7202 0.5541 0.4953 11.4530 4.4248 3.0885 10.6805 2.1591 0.0758 2.2456 7.8705 2.3015 4.2671 1.0198 79.7067 10.9912 12.5751 7.0489 0.7402 0.0278 10.9335 29.8136 1.4797 11.2439 9.5023 14.2383 12.6332 17.7924 17.7439 7.7010 1.7405 0.9890 0.7482 0.7278 34.5529 8.3459 22.7333 10.6883 1.4528 7.2915 10.0350 3.8477 7.6811 2.4761 13.0494 14.9160 2.9481 1.1257 11.9944 20.0275 1.3634 108.5151 19.1049 16.9660 66.8807 30.3920 12.3372 19.3221 31.8276 37.4551 31.0112 80.6504 32.6567 42.3287 0.6116 22.9374 87.2439 51.5396 18.3874 24.5929 35.9113
temp: 298.150 k
press: 1.00000 atm
elementType: 8 6 6 6 6 6 6 6 6 6 6 6 1 1 1 1 1 1 1 1 1 1 1 1 1 1 1 1 1 1 1 1
symmnumber: 1
zpe: 746782.5 jmol-1
zpe.correction: 0.284434 hartree
zpe.thermalcorrener: 0.298595 hartree
zpe.thermalcorrenthalpy: 0.299540 hartree
zpe.thermalcorrgfe: 0.244524 hartree
zpe.sumelectzpe: -505.386945 hartree
zpe.sumelectthermal: -505.372784 hartree
zpe.sumelectthermalent: -505.371839 hartree
zpe.sumelectthermalfe: -505.426855 hartree
dipole: 1.4249 0.3445 -0.9304
dipole: 1.7363
quadrupole: -68.7889 -74.4958 -76.2093
quadrupole: -1.0868 0.3380 -0.1337
quadrupole: 4.3758 -1.3311 -3.0446 -1.0868 0.3380 -0.1337
hfenergy: -505.6713791 hartree
pointgroup: C01 [X(C11H20O1)]
dipole: 0.5586295 -0.132378 0.3702019 debye
polarizability: 145.1342378|6.9828037|116.1061507|0.6814897|-0.1976681|99.0363493 unknown
InChI: InChI=1S/C11H20O/c1-9-5-7-10(8-6-9)11(2,3)12-4/h5,10H,6-8H2,1-4H3
charge 0 multiplicity 1
32 atoms
O  1.989618 0.090558 -1.029073
C  0.159929 -0.065218 0.529101
C  1.723662 -0.054422 0.434477
C  -0.492237 -1.225066 -0.266258
C  -0.464767 1.279054 0.066892
C  -2.014501 -1.297104 -0.009521
C  -2.698677 0.059678 -0.107647
C  -1.973483 1.211393 -0.086127
C  2.329758 -1.378099 0.964262
C  2.319274 1.145173 1.21387
C  -4.210552 0.049206 -0.225122
C  3.390557 0.149383 -1.437108
H  -0.084158 -0.207375 1.604797
H  -0.035169 -2.194942 0.002984
H  -0.295804 -1.060029 -1.341636
H  0.005029 1.572803 -0.894495
H  -0.221002 2.083524 0.789026
H  -2.213606 -1.734269 0.993747
H  -2.481402 -1.996135 -0.734541
H  -2.499652 2.173433 -0.179159
H  3.429115 -1.312588 1.05238
H  1.928416 -1.606135 1.96869
H  2.088015 -2.220627 0.294878
H  3.422097 1.091225 1.260391
H  1.941672 1.148886 2.252989
H  2.040703 2.101503 0.740603
H  -4.537567 -0.480277 -1.142723
H  -4.6284 1.070912 -0.252216
H  -4.67324 -0.487094 0.628268
H  3.370385 0.246362 -2.534876
H  3.948173 -0.771497 -1.169324
H  3.920015 1.026083 -1.01063
