program: Gaussian 09
title: 000085735
version: EM64L-G09RevD.01
frameworkgroup: C1[X(C7H12O2)]
method: RPBEPBE
basis: SDD
operation: Freq
keyword: #pfreq=noraman
keyword: PBEPBE/SDD
title: #p freq=noraman PBEPBE/SDD
converged: YES YES NO NO
title: Mulliken charges:
elementType: O O C C C C C C C H H H H H H H H H H H H
charge: -0.466933 -0.462917 -0.183854 -0.195685 -0.487863 -0.141686 -0.111567 -0.437434 -0.473258 0.231487 0.240738 0.222762 0.241945 0.246703 0.225858 0.221745 0.224385 0.214880 0.221772 0.337298 0.331626
chargesum: 0.00000
title: Mulliken charges with hydrogens summed into heavy atoms:
elementType: O O C C C C C C C
charge: -0.129635 -0.131292 0.047632 0.045053 -0.023156 0.105016 0.114291 0.008696 -0.036606
polarizability: 7.72952282e+01 2.70532982e+00 7.78161258e+01 -4.82053924e-01 2.00942027e+00 7.07391099e+01
1716.lowfreq: -0.0010 -0.0009 -0.0004 2.9368 13.9637 19.5034 97.5341 229.1463 248.1777
frequency: 97.5127 229.1449 248.1760 254.6868 279.0979 312.0914 362.5675 403.7493 445.1529 536.6510 580.8917 745.8737 770.0561 804.0778 838.1845 888.0335 900.5462 913.3826 931.0181 945.1400 971.7810 989.8286 1001.5751 1027.6937 1045.2291 1071.4267 1113.8915 1123.1031 1153.4952 1166.7939 1183.1610 1201.6822 1224.8552 1254.5178 1262.6620 1273.7539 1289.7276 1303.2372 1308.5603 1319.4991 1342.3477 1407.6764 1458.2150 1465.8346 1482.6159 2991.5200 2999.3666 3001.8126 3013.7251 3014.4166 3049.6111 3056.3541 3062.6573 3082.3745 3086.6753 3564.6412 3571.7198
redmass: 3.2530 2.4796 1.6686 1.6087 1.6250 2.0341 2.7050 2.5711 2.8668 4.4307 3.9303 3.4391 4.6730 1.4278 2.6490 2.4980 2.5916 2.8562 2.7143 2.0002 1.6240 2.0536 2.1949 2.3735 1.9683 1.7112 1.1290 1.0836 2.0064 1.1763 1.4668 1.2926 1.2803 1.5788 1.3981 1.4747 1.4224 1.5102 1.5315 1.4848 1.3006 1.6103 1.0811 1.0910 1.0977 1.0857 1.0607 1.0846 1.0595 1.0631 1.0888 1.1019 1.0920 1.1049 1.1061 1.0659 1.0661
irintensity: 0.1304 6.3808 32.6405 106.0767 58.7582 118.0003 11.4413 0.7705 0.4049 10.6949 1.5059 7.9527 5.7977 9.4872 18.1989 3.8856 9.5722 22.8072 16.6248 1.6762 6.3973 49.6684 65.5415 24.1689 13.7625 4.0565 13.8027 4.8467 6.4693 29.9554 14.5573 12.1465 6.5868 15.1420 1.6571 5.4940 1.8480 6.0096 21.4484 8.5344 1.3940 0.1381 3.4376 15.2239 8.7238 23.3677 21.3671 52.9620 32.1419 60.6352 89.6111 16.0102 11.3228 23.3760 48.6001 4.1273 5.4230
temp: 298.150 k
press: 1.00000 atm
elementType: 8 8 6 6 6 6 6 6 6 1 1 1 1 1 1 1 1 1 1 1 1
symmnumber: 1
zpe: 475061.4 jmol-1
zpe.correction: 0.180941 hartree
zpe.thermalcorrener: 0.189185 hartree
zpe.thermalcorrenthalpy: 0.190129 hartree
zpe.thermalcorrgfe: 0.148639 hartree
zpe.sumelectzpe: -423.645543 hartree
zpe.sumelectthermal: -423.637300 hartree
zpe.sumelectthermalent: -423.636356 hartree
zpe.sumelectthermalfe: -423.677846 hartree
dipole: 1.2415 -0.7451 0.3998
dipole: 1.5021
quadrupole: -57.4040 -49.1563 -54.2600
quadrupole: 3.0158 2.5226 6.1279
quadrupole: -3.7972 4.4505 -0.6532 3.0158 2.5226 6.1279
hfenergy: -423.8264848 hartree
pointgroup: C01 [X(C7H12O2)]
dipole: -0.5087167 -0.2539766 -0.1610719 debye
dipolederiv: -0.6163678 -0.1580492 0.0021722 -0.1513944 -0.7031741 -0.2672941 -0.050014 -0.3745414 -0.2937853 -0.9430404 0.0851636 -0.000042 0.0720851 -0.3810511 -0.2034902 0.0693412 -0.2283932 -0.3155641 -0.0212401 -0.084641 -0.0161772 -0.0416462 -0.0448152 -0.0893799 0.003997 -0.1110796 0.0839995 -0.1031959 -0.0052046 -0.0054796 -0.0792396 0.0962071 -0.0280422 0.0008277 -0.0643685 0.0192805 0.0671793 0.0066505 -0.0251271 0.0350065 -0.0167315 0.0222613 0.0078806 0.0123679 -0.0260027 0.3651249 0.1260429 0.0079342 0.1360234 0.5895359 0.1771669 0.0115501 0.2770073 0.2525881 0.719305 -0.1235817 -0.0021203 -0.0887687 0.2692855 0.0775891 -0.0648674 0.1487855 0.2367994 0.060449 0.0001207 0.0686657 -0.0104552 0.0267072 0.0371519 0.0415867 0.0281798 0.012622 0.0231945 0.0902984 0.0178924 0.0400703 0.0527276 0.0317776 0.0142507 0.0171391 0.0747424 0.0298686 0.0306689 -0.0362555 0.0428462 -0.0407262 0.1364063 -0.0426875 0.1308121 -0.0933751 0.0285243 0.0731029 -0.0192755 0.0664823 -0.1728911 0.0680912 -0.0208959 0.0692717 0.0455918 -0.1040811 -0.1186493 -0.1074888 -0.0935994 -0.0030085 -0.0509165 -0.0630356 -0.0300119 0.0418519 -0.0186535 0.0551349 0.1484438 0.0307078 0.0597539 -0.0249221 0.1000868 -0.042559 -0.0373943 -0.0570805 -0.0284523 0.0916796 -0.0240465 -0.0083017 -0.0173125 0.1074645 -0.0270142 -0.0779247 -0.0322751 0.0195896 -0.0071733 0.0057263 0.0245901 -0.0492997 -0.0143556 -0.0684003 -0.1629428 -0.1813615 0.0161114 -0.0668942 -0.0306872 0.0499109 0.0033701 -0.0880507 0.0263913 0.0363409 0.108064 0.0151865 -0.0130774 0.0650973 -0.0866679 -0.0789849 0.0270486 -0.0943107 0.0022557 0.0641489 0.0040132 -0.0773166 0.003724 0.0490748 -0.0629564 -0.0245369 -0.0140076 -0.1731649 -0.1070819 -0.121873 0.041303 -0.1161893 -0.0550246 0.0501986 0.0039021 0.0062796 0.0633873 0.3705122 0.1000181 -0.03388 0.0467258 0.1704511 0.1067265 -0.0203952 0.1666586 0.1297759 0.3480069 0.0183496 0.0322166 0.0915316 0.1241478 0.1618589 0.0009028 0.1717938 0.1809187 unknown
polarizability: 76.9219491|-2.6414971|78.310018|-0.7872953|-1.6567092|70.6184967 unknown
InChI: InChI=1S/C7H12O2/c8-6-4-1-2-5(3-4)7(6)9/h4-9H,1-3H2
charge 0 multiplicity 1
21 atoms
O  0.66506 2.096743 0.515128
O  2.263068 -0.869763 -0.082214
C  -0.777717 0.558213 -0.934403
C  -0.201614 -1.297744 0.262283
C  -0.587087 -0.963879 -1.209694
C  0.628205 0.913414 -0.353908
C  1.005716 -0.342369 0.482394
C  -1.812478 0.55584 0.227099
C  -1.409378 -0.718006 1.059005
H  -1.066707 1.17865 -1.799964
H  0.023304 -2.353843 0.488914
H  -1.513622 -1.460243 -1.547848
H  0.229294 -1.184806 -1.920073
H  1.366878 1.008225 -1.175716
H  1.137575 -0.072456 1.548916
H  -2.839926 0.47197 -0.17031
H  -1.744935 1.480941 0.82433
H  -1.134331 -0.464456 2.099199
H  -2.236765 -1.448891 1.100891
H  0.566485 2.908567 -0.042471
H  2.555675 -1.644306 0.46144
