program: Gaussian 09
title: 000085725
version: EM64L-G09RevD.01
frameworkgroup: C1[X(C12H19NO)]
method: RPBEPBE
basis: SDD
operation: Freq
keyword: #p
keyword: freq=noraman
keyword: PBEPBE/SDD
title: #p freq=noraman PBEPBE/SDD
converged: YES YES NO NO
title: Mulliken charges:
elementType: O N C C C C C C C C C C C C H H H H H H H H H H H H H H H H H H H
charge: -0.268988 -0.302367 -0.025379 -0.617077 0.506425 -0.714387 -0.324706 -0.406780 -0.402562 -0.698454 -0.360387 -0.360088 0.316067 -0.538009 0.196866 0.191137 0.230689 0.240181 0.235809 0.218135 0.216672 0.214345 0.175241 0.227652 0.237500 0.200391 0.232193 0.213019 0.236596 0.247574 0.219401 0.244041 0.219251
chargesum: 0.00000
title: Mulliken charges with hydrogens summed into heavy atoms:
elementType: O N C C C C C C C C C C C C
charge: -0.268988 -0.062186 0.171487 -0.195251 0.506425 -0.043772 0.064881 -0.179129 -0.165062 -0.052852 -0.123791 -0.112514 0.316067 0.144685
polarizability: 2.04456422e+02 2.09674460e+00 1.29288809e+02 -1.23148469e+01 -8.69829605e-01 9.70921639e+01
1716.lowfreq: -19.6301 -6.2428 -4.8686 -0.0008 0.0004 0.0008 29.7168 34.7063 46.1899
frequency: 28.7045 34.4685 46.1830 83.7091 98.1808 99.9136 146.0048 177.0877 204.7486 230.3984 241.1145 254.8328 277.5469 332.2570 345.7651 360.7666 413.5430 435.1284 444.5699 490.0684 518.8869 555.1979 633.1553 663.7288 711.7058 744.2260 805.8522 812.2178 820.7251 827.2944 853.1318 887.6162 907.6496 933.6934 959.7807 964.9980 988.2888 1003.5678 1049.7844 1057.6731 1091.5485 1111.9843 1117.4412 1125.5127 1151.9476 1155.7280 1177.0893 1180.7559 1210.2193 1221.0640 1230.1723 1255.9238 1277.8000 1304.0330 1316.5649 1342.0893 1358.7153 1380.5826 1382.0953 1390.3304 1415.0263 1435.6752 1457.0569 1466.1941 1466.5001 1469.1254 1473.3870 1474.6589 1480.8978 1482.3741 1499.4013 1502.0289 1584.3270 1623.4290 2829.1374 2849.3873 2957.2507 2958.8212 2976.5389 2984.0157 3016.0885 3037.4998 3044.1778 3069.7401 3080.8366 3089.0720 3090.8996 3115.7481 3122.5966 3127.2990 3159.5709 3164.8994 3403.8136
redmass: 2.9261 3.5637 3.9299 1.7541 3.2811 2.5449 3.6149 3.1608 1.5544 1.6401 1.2718 1.1892 3.0327 3.5723 2.3825 2.9640 2.9415 3.7585 2.4726 2.6120 3.3586 2.7106 6.5822 1.5779 3.6746 3.8014 1.8202 1.1950 1.5644 2.2981 2.1548 1.3768 1.8110 1.3845 1.5265 1.6992 8.6721 2.6482 1.7115 2.2174 1.8096 1.2603 1.4243 1.5262 2.6641 1.3387 1.4527 1.8006 1.5583 1.9573 4.0135 1.1494 1.2862 1.3117 1.3436 1.4314 1.3815 3.8074 1.3300 1.2427 3.2666 1.1696 1.1776 1.0876 1.0504 1.0635 1.0774 1.1005 1.0472 1.0505 1.0903 2.4735 7.0390 6.4685 1.0810 1.0724 1.0345 1.0625 1.0375 1.0357 1.0857 1.0966 1.1038 1.0977 1.0991 1.0994 1.1001 1.0893 1.0991 1.0892 1.0933 1.0955 1.0737
irintensity: 0.2192 0.0560 0.1738 2.7029 4.5539 0.4826 1.6842 1.6898 1.3439 2.0855 0.3115 1.1477 0.4556 1.8883 0.6198 5.1671 0.0414 2.4995 0.6159 5.0850 17.4986 45.2087 1.3258 58.8516 4.7640 6.1311 39.2378 5.5182 2.7503 13.5582 27.6520 2.6501 1.6007 0.0339 0.1780 0.8575 41.8635 8.4487 4.2101 3.0926 7.9813 0.2697 10.2821 10.0406 32.2541 0.9108 99.5996 12.4329 20.8320 42.3823 132.2139 17.0364 4.4603 2.4481 11.8539 26.7103 3.2211 14.7974 14.4222 17.2244 1.2812 10.6259 25.0849 5.1358 13.0398 1.4103 64.5960 19.1192 14.1535 3.4304 10.3934 112.1776 5.6388 41.2755 73.9906 129.7298 75.9990 41.8582 38.2852 16.4399 23.9007 19.9179 51.9815 57.3240 42.9344 31.9246 38.8468 23.1565 23.1083 15.9293 17.3869 4.8306 4.4898
temp: 298.150 k
press: 1.00000 atm
elementType: 8 7 6 6 6 6 6 6 6 6 6 6 6 6 1 1 1 1 1 1 1 1 1 1 1 1 1 1 1 1 1 1 1
symmnumber: 1
zpe: 748463.0 jmol-1
zpe.correction: 0.285074 hartree
zpe.thermalcorrener: 0.300640 hartree
zpe.thermalcorrenthalpy: 0.301584 hartree
zpe.thermalcorrgfe: 0.241035 hartree
zpe.sumelectzpe: -597.535613 hartree
zpe.sumelectthermal: -597.520048 hartree
zpe.sumelectthermalent: -597.519103 hartree
zpe.sumelectthermalfe: -597.579652 hartree
dipole: -0.2713 -2.5778 0.3595
dipole: 2.6168
quadrupole: -78.8217 -80.5363 -88.3005
quadrupole: 4.7426 -1.5280 0.0518
quadrupole: 3.7311 2.0165 -5.7476 4.7426 -1.5280 0.0518
hfenergy: -597.8206877 hartree
pointgroup: C01 [X(C12H19N1O1)]
dipole: 0.1149097 -0.9930829 -0.2460119 debye
polarizability: 204.5576509|-0.2650125|128.7504825|-12.0895586|4.0986723|97.5292611 unknown
InChI: InChI=1S/C12H19NO/c1-4-13-10(2)9-11-5-7-12(14-3)8-6-11/h5-8,10,13H,4,9H2,1-3H3
charge 0 multiplicity 1
33 atoms
O  4.398498 0.235189 -0.313037
N  -3.548705 -0.132467 0.290334
C  -2.157083 0.01663 -0.209828
C  -1.219332 0.135588 1.029918
C  0.261393 0.132041 0.688119
C  -2.036383 1.244364 -1.134759
C  -4.578029 -0.468652 -0.719702
C  0.930599 -1.070583 0.3546
C  1.018843 1.334531 0.673884
C  -5.92824 -0.75576 -0.039674
C  2.30299 -1.090651 0.014047
C  2.385558 1.339195 0.337677
C  3.032777 0.123662 0.004682
C  5.111492 -0.99485 -0.662384
H  -1.834016 -0.886238 -0.792638
H  -1.445964 -0.714797 1.707648
H  -1.494536 1.059253 1.572976
H  -3.581349 -0.806958 1.070298
H  -0.985961 1.39688 -1.437958
H  -2.393102 2.147594 -0.606485
H  -2.637066 1.121907 -2.053587
H  -4.695341 0.389745 -1.407244
H  -4.283475 -1.346535 -1.350716
H  0.374119 -2.016485 0.367616
H  0.528162 2.280328 0.933161
H  -5.857456 -1.626843 0.640669
H  -6.250992 0.117056 0.554862
H  -6.707464 -0.979012 -0.790369
H  2.784028 -2.042289 -0.23208
H  2.970255 2.264267 0.329206
H  5.109581 -1.715652 0.178751
H  6.143295 -0.678592 -0.875691
H  4.675403 -1.473566 -1.561093
