program: Gaussian 09
title: 000085574
version: EM64L-G09RevD.01
frameworkgroup: C1[X(C11H11NO)]
method: RPBEPBE
basis: SDD
operation: Freq
keyword: #p
keyword: freq=noraman
keyword: PBEPBE/SDD
title: #p freq=noraman PBEPBE/SDD
converged: YES YES NO NO
title: Mulliken charges:
elementType: O N C C C C C C C C C C C H H H H H H H H H H H
charge: -0.263138 -0.019728 0.114278 -0.527526 -0.525417 0.446443 -0.206576 -0.416109 -0.390291 -0.349516 -0.348597 0.322393 -0.538161 0.254508 0.259198 0.259200 0.253381 0.241858 0.245616 0.242306 0.253003 0.221021 0.224184 0.247672
chargesum: 0.00000
title: Mulliken charges with hydrogens summed into heavy atoms:
elementType: O N C C C C C C C C C C C
charge: -0.263138 -0.019728 0.114278 -0.013820 -0.012836 0.446443 -0.206576 -0.174252 -0.144675 -0.107210 -0.095594 0.322393 0.154716
polarizability: 1.69807321e+02 -9.79825853e-01 1.06397430e+02 -2.53387060e+00 5.85965367e+00 9.44211303e+01
1716.lowfreq: -2.3813 -0.0011 -0.0007 -0.0007 8.8084 11.6258 26.8129 57.8618 105.3411
frequency: 26.7431 57.8539 105.3411 131.9189 153.6111 206.5383 213.9776 242.5435 251.9155 334.9518 394.4210 408.7759 416.1721 477.3872 518.1801 568.6675 576.8449 595.7724 632.3444 735.3588 764.1207 795.5048 816.4843 835.5561 854.1586 864.3528 934.3819 947.1683 953.4337 966.9960 987.6664 1002.4632 1065.9085 1083.0542 1101.9498 1113.3197 1113.9776 1156.9088 1172.1265 1179.0146 1230.9990 1256.2828 1299.6379 1314.2306 1367.4811 1417.8184 1437.8888 1443.1324 1464.2449 1467.9563 1473.0373 1504.7340 1580.6348 1623.1307 2177.4921 2961.0941 3049.5070 3105.3143 3113.8889 3128.8460 3133.1541 3136.4027 3167.0532 3170.6476 3208.9711 3225.2417
redmass: 4.2110 4.9870 4.2989 4.0923 4.8909 2.1013 2.6101 2.1004 2.0039 6.6803 4.7456 4.3954 2.9692 4.1449 3.4466 3.8515 5.3178 5.7374 6.7936 3.7667 3.6279 1.2104 1.3285 1.5659 2.0136 8.6367 2.1141 1.2436 1.8007 1.3608 8.2988 2.8346 1.1799 1.3459 2.3007 1.2900 1.3136 1.3241 1.3145 1.2122 3.1924 3.9307 1.3134 3.4180 5.8510 3.8655 1.1706 1.0843 1.2248 1.0498 1.0719 2.6021 7.3522 6.4196 12.5974 1.0331 1.1040 1.0507 1.0625 1.0990 1.0896 1.0893 1.0940 1.0958 1.1182 1.1163
irintensity: 1.8560 2.1488 6.1507 0.4579 1.7783 1.3640 1.0165 1.3046 2.3902 4.2871 0.9093 1.1465 0.0058 2.0898 10.0590 31.5426 0.8019 10.3547 1.0445 5.1935 4.0590 2.0185 15.9945 43.0179 2.1849 3.7610 13.0050 2.5520 8.4206 0.1726 46.4468 8.4237 17.7924 12.3200 3.2755 3.3936 5.4022 1.3325 0.1179 60.5857 173.7160 6.7337 4.2663 34.8104 9.1974 4.1967 8.5068 11.8810 7.4876 14.1391 50.3725 106.6799 9.3691 60.2015 35.9727 63.8254 47.0386 9.1778 2.7062 27.8515 5.4139 10.5521 13.6232 3.0429 0.0235 14.6061
temp: 298.150 k
press: 1.00000 atm
elementType: 8 7 6 6 6 6 6 6 6 6 6 6 6 1 1 1 1 1 1 1 1 1 1 1
symmnumber: 1
zpe: 497746.3 jmol-1
zpe.correction: 0.189582 hartree
zpe.thermalcorrener: 0.201702 hartree
zpe.thermalcorrenthalpy: 0.202646 hartree
zpe.thermalcorrgfe: 0.150455 hartree
zpe.sumelectzpe: -554.747979 hartree
zpe.sumelectthermal: -554.735859 hartree
zpe.sumelectthermalent: -554.734915 hartree
zpe.sumelectthermalfe: -554.787106 hartree
dipole: 2.8139 0.2745 -4.0725
dipole: 4.9577
quadrupole: -72.0094 -72.7380 -83.7271
quadrupole: -12.5332 9.4779 6.7099
quadrupole: 4.1488 3.4202 -7.5690 -12.5332 9.4779 6.7099
hfenergy: -554.937561 hartree
pointgroup: C01 [X(C11H11N1O1)]
dipole: 1.1617731 -1.2486272 0.9463805 debye
dipolederiv: -1.807579 -0.1885495 -0.2049235 -0.1614524 -0.3201941 -0.0308611 -0.0772165 -0.0166449 -0.3317992 -0.2679869 0.1045052 -0.0281389 0.1537661 -0.3846234 0.0408292 -0.0398104 0.0372345 -0.2379029 0.3648179 -0.0691443 0.02503 -0.0455369 -0.2182876 0.1273445 0.0053894 0.128372 0.1909449 -0.0144276 0.0456388 -0.0286561 -0.0449015 0.0185762 -0.0400085 -0.0775953 -0.2201243 -0.0082278 -0.0043581 0.0699342 -0.0174461 0.0026558 0.125571 -0.0417712 0.0814466 0.1285062 -0.1249954 0.1204665 0.009351 -0.0480451 -0.0733114 -0.1876537 0.0064205 0.0245386 0.0113071 -0.1538958 -0.1562141 -0.273821 0.0772172 -0.2723282 0.3550883 -0.103273 0.0819433 -0.0974579 -0.024859 0.1007214 0.0244262 0.0652916 0.0479974 -0.0891547 0.0700555 0.0097083 0.0558687 0.0971737 0.1027016 -0.0000279 -0.0264465 0.0267074 -0.1018786 0.0528826 -0.0637832 0.0599749 0.1029883 -0.3844123 -0.0220805 -0.0183532 0.0814708 -0.1751176 0.0412164 0.3350769 0.0660353 -0.0471288 -0.4052055 -0.0272642 -0.020554 -0.0938785 -0.1558118 0.0461852 -0.2653217 0.0334204 0.0230453 1.6229216 0.1473737 0.046857 0.0819931 0.1047241 -0.0126989 -0.2276174 -0.0375149 0.0455916 0.6381441 0.0691047 0.147268 0.1705625 0.3452592 0.0318847 0.4869927 0.0593112 0.387248 0.0567745 0.0618057 0.03928 0.0980954 -0.0120658 -0.0447399 -0.0004784 -0.0485028 0.0571683 -0.0599231 -0.0042372 -0.0828912 0.0100522 0.077828 -0.0103353 -0.0626231 -0.030236 0.0546405 -0.0444173 0.0434341 0.0796298 0.0442604 0.0864262 -0.0193724 0.0585906 0.0030984 0.028167 0.0465927 0.0390038 -0.0685116 0.0884006 0.044296 0.0459515 -0.0549082 0.0520107 0.0072408 0.0471539 0.0136245 0.0871344 0.0181435 0.1220254 -0.031492 0.0888821 -0.037941 -0.0333142 0.0311155 -0.0387324 -0.0962753 -0.0336444 0.1137181 -0.0530261 -0.0890751 -0.0445414 -0.002877 0.0098076 -0.0377809 -0.0827593 -0.0474662 0.1451951 -0.0533658 -0.0948419 -0.0561889 -0.005157 0.0459228 0.0082614 0.0722388 0.002572 0.1548125 -0.0425738 0.0743522 -0.041395 -0.0073366 0.0578347 -0.0460989 0.0326242 -0.025254 -0.0361092 0.1112584 -0.147499 0.0884325 -0.1039289 0.0469831 0.0875385 0.01637 -0.0248748 -0.1333986 -0.0798981 -0.126182 -0.0865172 0.0126169 -0.1474339 -0.0162649 0.0340597 -0.0040291 0.1207749 -0.0106122 0.0800315 -0.0065076 0.074597 unknown
polarizability: 169.7124115|2.3790989|93.5722473|2.6677666|4.8969973|107.3412232 unknown
InChI: InChI=1S/C11H11NO/c1-13-10-4-2-9(3-5-10)11(8-12)6-7-11/h2-5H,6-7H2,1H3
charge 0 multiplicity 1
24 atoms
O  3.675962 0.07126 -0.432399
N  -3.291199 1.995693 -0.432589
C  -2.03774 -0.272285 0.129365
C  -2.775366 -1.584168 -0.251756
C  -2.689614 -1.172543 1.213642
C  -0.528263 -0.202426 0.020115
C  -2.730009 0.970607 -0.178905
C  0.257994 0.185325 1.128426
C  0.119988 -0.479679 -1.212074
C  1.663258 0.288864 1.029201
C  1.516899 -0.382538 -1.32994
C  2.294229 0.003539 -0.207825
C  4.527431 0.482718 0.686979
H  -2.143033 -2.407721 -0.594597
H  -3.739107 -1.49354 -0.759383
H  -3.595182 -0.80265 1.701355
H  -1.999268 -1.718064 1.862938
H  -0.232085 0.411726 2.082583
H  -0.477943 -0.771908 -2.082914
H  2.245142 0.590839 1.904696
H  2.028834 -0.594312 -2.273276
H  4.450417 -0.226637 1.533953
H  4.272211 1.503289 1.032547
H  5.551343 0.472012 0.286559
