program: Gaussian 09
title: 000085616
version: EM64L-G09RevD.01
frameworkgroup: C1[X(C12H12N2O3)]
method: RPBEPBE
basis: SDD
operation: Freq
keyword: #p
keyword: freq=noraman
keyword: PBEPBE/SDD
title: #p freq=noraman PBEPBE/SDD
converged: YES YES NO NO
title: Mulliken charges:
elementType: O O O N N C C C C C C C C C C C C H H H H H H H H H H H H
charge: -0.248835 -0.197009 -0.270431 -0.299228 -0.032035 0.406967 0.147026 0.154707 0.027229 -0.365976 -0.288182 -0.736748 -0.152345 -0.384372 0.203248 -0.223203 -0.672281 0.240534 0.275955 0.256179 0.282714 0.213390 0.249726 0.285634 0.229591 0.226037 0.206421 0.227353 0.237935
chargesum: 0.00000
title: Mulliken charges with hydrogens summed into heavy atoms:
elementType: O O O N N C C C C C C C C C C C C
charge: -0.248835 -0.197009 -0.270431 -0.299228 -0.032035 0.406967 0.147026 0.154707 0.027229 -0.125442 -0.012227 0.015535 0.097380 -0.098738 0.203248 0.232425 -0.000572
polarizability: 2.52156135e+02 -8.83378431e+00 1.75108554e+02 4.37799187e+00 3.19968637e+00 7.58757046e+01
1716.lowfreq: -2.5756 -0.0009 -0.0008 -0.0005 3.1942 10.4254 27.5765 45.7439 63.8647
frequency: 27.3802 45.7316 63.8259 65.4898 90.0181 117.6385 185.8498 205.3381 228.2177 233.8051 244.7399 270.1527 294.4189 324.8016 351.0805 369.6784 420.8642 457.0531 459.3083 488.0961 519.6009 561.4516 576.8596 615.2063 664.8277 682.9981 731.7269 752.2119 776.4461 793.7302 798.1780 805.1924 817.9988 861.1278 897.7128 957.2377 970.7059 995.6584 1007.7939 1021.0217 1035.0713 1047.0383 1082.1226 1097.7138 1113.4524 1133.9161 1162.6402 1223.0040 1239.2116 1246.7332 1271.0066 1280.5004 1331.7218 1357.0065 1380.7966 1401.2846 1407.6821 1416.2448 1443.1513 1458.7011 1462.0980 1472.6250 1486.0990 1486.3324 1507.5402 1572.3435 1585.1920 1626.7606 1660.8754 2996.1695 3006.6345 3007.8086 3066.3570 3092.5929 3099.7250 3108.4764 3109.3553 3153.5562 3157.4206 3178.2901 3198.3927
redmass: 4.4085 4.8920 3.0073 5.1592 3.8087 2.8796 2.9064 4.2101 1.3124 3.4922 1.3645 4.4856 5.9063 5.4250 5.8255 3.6325 5.0828 3.9758 4.1415 3.9693 6.4740 5.6270 9.3363 3.8077 7.6285 6.6423 5.2939 6.2345 4.0304 6.6311 1.1103 1.6708 3.8588 6.4118 1.3725 2.6445 1.4433 1.3397 5.7010 2.2990 2.2649 1.5870 4.2496 2.0247 2.2139 1.4586 1.3320 2.7153 2.9242 1.1419 2.4662 3.8403 1.9035 1.5195 2.4842 1.2818 1.2706 2.6525 1.2233 1.4801 1.0407 1.0657 1.3433 1.4415 4.2749 7.4713 10.9836 6.1631 11.6240 1.0360 1.0368 1.0579 1.1067 1.0985 1.0990 1.0985 1.1022 1.0926 1.0889 1.0944 1.0979
irintensity: 1.6755 2.4885 0.1203 0.2931 3.9975 0.8313 0.0863 1.1479 2.3748 1.4154 0.6558 6.3778 6.4283 10.2228 4.4312 5.5416 2.6026 1.1264 0.0583 0.4283 4.9065 4.2288 1.0028 1.1412 6.0684 1.6009 18.8616 6.6169 0.5958 5.2283 3.7628 68.9239 5.5306 18.8705 2.2148 17.3387 9.8665 1.0351 35.9469 41.3566 14.7197 11.7077 269.6998 134.4849 2.9434 5.6903 15.1454 16.9315 69.7122 0.0987 153.0519 128.4302 68.5542 2.1189 1.9699 23.6894 37.5891 4.1317 23.1753 115.5640 12.4058 12.1502 229.0137 166.2425 218.3234 46.1814 166.5930 57.7971 355.5776 22.1144 17.2007 23.1047 10.4403 34.7661 12.2340 11.0975 41.1808 0.7347 8.1511 7.1091 2.4417
temp: 298.150 k
press: 1.00000 atm
elementType: 8 8 8 7 7 6 6 6 6 6 6 6 6 6 6 6 6 1 1 1 1 1 1 1 1 1 1 1 1
symmnumber: 1
zpe: 579679.3 jmol-1
zpe.correction: 0.220788 hartree
zpe.thermalcorrener: 0.236291 hartree
zpe.thermalcorrenthalpy: 0.237236 hartree
zpe.thermalcorrgfe: 0.176861 hartree
zpe.sumelectzpe: -798.431120 hartree
zpe.sumelectthermal: -798.415616 hartree
zpe.sumelectthermalent: -798.414672 hartree
zpe.sumelectthermalfe: -798.475046 hartree
dipole: -3.9797 3.3528 -1.2845
dipole: 5.3600
quadrupole: -73.3040 -104.0483 -100.3820
quadrupole: 0.7119 -1.0332 -1.6643
quadrupole: 19.2741 -11.4702 -7.8039 0.7119 -1.0332 -1.6643
hfenergy: -798.6519077 hartree
pointgroup: C01 [X(C12H12N2O3)]
dipole: 1.607079 1.2993195 0.4194921 debye
polarizability: 252.5917313|7.0893145|174.4744245|-1.1037959|-6.4643245|76.0742375 unknown
InChI: InChI=1S/C12H12N2O3/c1-3-17-12(16)9-7-13-10-6-4-5-8(2)14(10)11(9)15/h4-7H,3H2,1-2H3
charge 0 multiplicity 1
29 atoms
O  -2.915949 0.403561 0.176585
O  -0.517345 1.483343 -0.793767
O  -3.001769 -1.91789 0.014033
N  1.396857 0.2356 -0.09074
N  1.171593 -2.195485 0.126318
C  2.237801 1.371399 -0.055669
C  1.944385 -1.079093 0.021743
C  -0.095166 0.39525 -0.330897
C  -0.846729 -0.806718 -0.021303
C  3.620869 1.179505 -0.018352
C  3.364935 -1.233415 0.038171
C  1.681078 2.776287 0.013289
C  4.198618 -0.123296 -0.000364
C  -0.175734 -2.034396 0.150516
C  -2.332074 -0.848679 0.033912
C  -4.409374 0.415817 0.251842
C  -4.821646 1.87603 0.404388
H  4.258061 2.066699 0.011778
H  3.732473 -2.259719 0.097618
H  0.891597 2.870679 0.777192
H  1.219214 3.08721 -0.936812
H  2.506307 3.463929 0.264503
H  5.286322 -0.241343 0.011171
H  -0.77811 -2.937374 0.294832
H  -4.805834 -0.043972 -0.671633
H  -4.722781 -0.209792 1.107568
H  -5.923645 1.951948 0.448348
H  -4.404759 2.308596 1.329933
H  -4.461596 2.473919 -0.449703
