program: Gaussian 09
title: 000085576
version: EM64L-G09RevD.01
frameworkgroup: C1[X(C11H21NO)]
method: RPBEPBE
basis: SDD
operation: Freq
keyword: #p
keyword: freq=noraman
keyword: PBEPBE/SDD
title: #p freq=noraman PBEPBE/SDD
converged: YES YES NO NO
title: Mulliken charges:
elementType: O N C C C C C C C C C C C H H H H H H H H H H H H H H H H H H H H H
charge: -0.268101 -0.021812 -0.376262 -0.371113 -0.377924 -0.352747 -0.396890 -0.356200 -0.271549 -0.695852 -0.214189 -0.436598 -0.120073 0.196791 0.193402 0.190001 0.188154 0.191687 0.188043 0.188039 0.189547 0.218937 0.211103 0.194265 0.195085 0.186087 0.194265 0.209750 0.210446 0.215252 0.200165 0.197785 0.264069 0.236438
chargesum: 0.00000
title: Mulliken charges with hydrogens summed into heavy atoms:
elementType: O N C C C C C C C C C C C
charge: -0.268101 -0.021812 0.013931 0.007041 0.001805 0.024839 0.033150 0.033149 0.108803 -0.060403 0.183761 0.063909 -0.120073
polarizability: 1.60498499e+02 -7.85609852e-01 1.19267221e+02 4.50554907e-01 -3.19601415e+00 1.02664456e+02
1716.lowfreq: -18.8558 -0.0011 -0.0005 -0.0001 1.7258 6.1863 19.0162 27.4108 35.3454
frequency: 16.9769 26.5310 35.2976 48.9441 65.4977 80.3467 106.8322 112.0668 123.2801 142.5729 150.5896 184.9824 209.9359 218.7464 237.1606 299.1918 364.0414 375.9788 403.8290 464.3630 492.7675 578.7696 720.4609 728.8424 753.6189 796.0958 817.7949 830.0655 862.2612 888.4138 937.5585 966.2475 990.9516 1007.9359 1017.0535 1029.7738 1045.7643 1056.5412 1076.5009 1079.8407 1081.7752 1089.6444 1125.7878 1149.9492 1185.8932 1192.9952 1218.2255 1221.9162 1241.3351 1257.9828 1263.5874 1274.6495 1281.5226 1291.4081 1295.1486 1303.2132 1326.7020 1334.5205 1348.7804 1354.3617 1357.7720 1389.0165 1401.7669 1433.2502 1461.0367 1461.7242 1466.7363 1468.6996 1473.4580 1477.7855 1479.1230 1484.4288 1488.1282 1492.6954 2205.5576 2910.5437 2929.4660 2950.0261 2952.3192 2954.3843 2961.4308 2962.3063 2968.1200 2971.8167 2979.8842 2984.7836 2992.2848 2992.8964 3004.2876 3009.9392 3022.6680 3038.0146 3059.5610 3067.9855 3068.3425 3070.9764
redmass: 3.3124 2.5222 3.6005 3.7504 1.9226 2.8776 2.1431 3.0253 3.1457 2.1084 2.4022 3.0363 4.0223 3.3345 1.1101 3.1665 4.0186 3.2234 3.3863 3.5115 3.0526 3.3558 1.0618 1.0816 1.1110 1.1604 2.7665 2.8262 1.2035 1.8949 1.1881 3.9453 4.3987 1.1173 3.2052 2.6752 2.7060 2.6975 2.4094 2.2589 3.9510 2.2310 2.9468 1.4086 1.6092 1.1646 1.2863 1.3917 1.1841 1.2624 1.2932 1.0761 1.0813 1.1213 1.1033 1.3078 1.4204 1.3337 1.3908 1.6471 1.6056 1.2167 1.4391 1.0905 1.0703 1.0750 1.0689 1.0801 1.0802 1.0453 1.0777 1.0840 1.0879 1.0866 12.4387 1.0548 1.0558 1.0588 1.0587 1.0592 1.1054 1.0592 1.0588 1.0364 1.1036 1.0967 1.0798 1.0778 1.1021 1.0618 1.1043 1.1047 1.1044 1.1005 1.1007 1.0993
irintensity: 2.4053 1.3266 1.2297 2.0286 0.8902 1.0786 0.4688 1.7546 3.5390 0.1338 3.4923 1.7964 0.7998 0.5484 0.0102 2.1417 0.4394 0.1087 4.4155 0.5423 2.1724 7.0855 14.3246 0.1489 4.3611 0.0571 5.0473 0.5828 0.5931 3.3488 0.6821 22.8352 1.9219 0.1227 13.8262 3.8109 4.1065 46.2746 10.3993 1.1339 120.2417 0.1647 5.6531 2.0927 0.4862 4.9667 8.9754 0.9871 2.9918 0.0531 0.5543 0.1361 0.5368 0.0947 0.0820 1.1083 8.5054 6.8651 28.1526 1.5260 4.6079 11.2437 0.3967 19.7151 0.0966 0.0236 0.6954 2.5363 6.6859 11.7049 1.2124 3.2401 17.7942 12.9781 9.1449 38.2724 94.8354 0.1297 9.5247 0.2299 49.6169 27.0805 150.4953 36.8297 40.1458 0.8456 19.3101 22.4963 1.2694 18.3983 0.0060 94.0483 92.8772 7.1850 100.6508 55.5251
temp: 298.150 k
press: 1.00000 atm
elementType: 8 7 6 6 6 6 6 6 6 6 6 6 6 1 1 1 1 1 1 1 1 1 1 1 1 1 1 1 1 1 1 1 1 1
symmnumber: 1
zpe: 787005.4 jmol-1
zpe.correction: 0.299755 hartree
zpe.thermalcorrener: 0.316676 hartree
zpe.thermalcorrenthalpy: 0.317620 hartree
zpe.thermalcorrgfe: 0.251470 hartree
zpe.sumelectzpe: -560.645252 hartree
zpe.sumelectthermal: -560.628330 hartree
zpe.sumelectthermalent: -560.627386 hartree
zpe.sumelectthermalfe: -560.693536 hartree
dipole: 1.2528 -4.7500 0.3618
dipole: 4.9258
quadrupole: -87.7711 -88.4292 -81.3243
quadrupole: 24.4863 -5.2351 1.7923
quadrupole: -1.9295 -2.5877 4.5172 24.4863 -5.2351 1.7923
hfenergy: -560.9450064 hartree
pointgroup: C01 [X(C11H21N1O1)]
dipole: 0.5341727 1.8574757 -0.1416593 debye
polarizability: 160.5102065|-0.1430522|119.2593659|-0.6594323|-3.1674243|102.6606031 unknown
InChI: InChI=1S/C11H21NO/c1-2-3-4-5-6-7-10-13-11-8-9-12/h2-8,10-11H2,1H3
charge 0 multiplicity 1
34 atoms
O  -2.799633 0.495534 -0.320809
N  -5.566362 -1.993798 0.529189
C  2.158887 -0.125816 -0.23613
C  3.522573 0.339718 0.322024
C  0.964003 0.679716 0.322057
C  4.717977 -0.464891 -0.236361
C  -0.392284 0.213994 -0.255451
C  6.083323 0.005125 0.315842
C  -1.570957 1.016397 0.300883
C  7.272151 -0.803412 -0.247309
C  -4.002279 1.183304 0.134692
C  -5.204662 0.444961 -0.485708
C  -5.398297 -0.905763 0.07009
H  2.015012 -1.201569 -0.004475
H  2.169131 -0.045172 -1.343095
H  3.512872 0.259763 1.429395
H  3.665728 1.416054 0.089583
H  0.949371 0.589938 1.428478
H  1.114816 1.756712 0.097622
H  4.726751 -0.389262 -1.344033
H  4.579645 -1.540833 -0.000224
H  -0.555394 -0.856904 -0.028071
H  -0.386935 0.309818 -1.358427
H  6.220736 1.080296 0.079633
H  6.073729 -0.070761 1.422476
H  -1.458441 2.09959 0.06559
H  -1.63726 0.907865 1.406969
H  7.320959 -0.720053 -1.349601
H  7.17517 -1.876908 0.002669
H  8.235752 -0.447229 0.161461
H  -4.006359 2.240763 -0.212147
H  -4.068358 1.178403 1.244384
H  -5.044343 0.365337 -1.576718
H  -6.127822 1.032885 -0.322978
