program: Gaussian 09
title: 000085596
version: EM64L-G09RevD.01
frameworkgroup: C1[X(C12H13N3O2S)]
method: RPBEPBE
basis: SDD
operation: Freq
keyword: #p
keyword: freq=noraman
keyword: PBEPBE/SDD
title: #p freq=noraman PBEPBE/SDD
converged: NO YES NO NO
title: Mulliken charges:
elementType: S O O N N N C C C C C C C C C C C C H H H H H H H H H H H H H
charge: 0.940239 -0.550291 -0.551133 -0.516042 -0.715932 -0.697210 0.473590 -0.083461 0.444272 -0.426791 -0.362673 -0.207193 -0.226777 -0.423206 -0.366051 0.504567 -0.396072 -0.413084 0.298440 0.230735 0.274227 0.278300 0.277288 0.236423 0.264235 0.220303 0.221290 0.328563 0.328920 0.306693 0.307831
chargesum: 0.00000
title: Mulliken charges with hydrogens summed into heavy atoms:
elementType: S O O N N N C C C C C C C C C C C C
charge: 0.940239 -0.550291 -0.551133 -0.217602 -0.058449 -0.082686 0.473590 -0.083461 0.444272 -0.196055 -0.088446 0.071107 0.050511 -0.186783 -0.101816 0.504567 -0.175769 -0.191794
polarizability: 3.49684064e+02 1.00655003e+01 1.72709957e+02 1.52666351e+01 -3.99056521e+00 1.09114055e+02
1716.lowfreq: -4.6525 -1.6554 -0.0024 -0.0011 -0.0007 5.3381 25.2194 28.1400 41.5718
frequency: 24.6534 28.1266 41.5660 62.9669 88.8237 112.2767 120.6032 159.2839 173.9983 206.7115 260.5538 273.6222 290.5942 315.9660 339.8082 352.4566 359.3120 360.6261 370.7329 400.3244 410.7117 418.6683 433.5305 462.8997 494.4156 505.8696 531.1542 551.1103 617.0899 626.7629 657.0199 710.2206 720.0599 778.4597 791.1480 806.8598 812.9707 818.3435 823.9605 826.8783 843.5860 863.4138 902.2922 931.2902 946.5665 957.5695 977.4282 981.3911 996.5721 1018.1819 1054.8101 1067.7223 1122.7108 1132.2206 1183.9783 1186.9425 1227.7226 1269.9235 1303.7854 1309.6317 1329.6763 1365.0564 1386.2758 1428.1168 1442.8272 1477.8583 1503.1516 1520.5530 1532.5603 1582.2784 1590.3345 1607.9341 1636.1704 1648.6744 3118.9825 3124.6324 3126.3219 3142.2833 3152.4345 3155.9619 3163.2720 3176.8978 3353.9837 3521.5924 3538.2241 3568.7893 3708.4968
redmass: 6.0709 4.3650 4.6906 3.5123 5.3461 1.6034 5.8079 6.0181 5.5423 7.2090 3.3432 4.5134 5.7569 5.1563 2.2871 1.7230 1.0896 3.9755 5.3484 2.5303 2.7908 3.0621 8.9392 2.3293 2.2325 2.6215 2.7273 5.2549 6.6542 6.0245 6.0003 3.6327 3.4048 3.5873 5.0399 1.3667 2.1664 2.0694 1.5220 2.1135 1.6835 4.9328 4.2500 1.3683 1.3408 1.3428 1.3235 4.7699 2.7398 1.4271 2.5334 1.4519 1.3056 1.2241 1.1176 1.1235 2.8392 1.4148 1.5646 1.8279 2.1217 3.3911 6.1209 4.9482 3.6252 2.0834 2.4617 3.3330 1.0876 7.5058 4.3269 6.0557 1.7810 2.2006 1.0871 1.0883 1.0893 1.0967 1.0896 1.0955 1.0952 1.0955 1.0414 1.0995 1.0755 1.0450 1.1041
irintensity: 0.0255 0.0218 0.8675 4.7268 7.0982 38.6236 1.4219 1.3919 2.5350 4.7170 4.3640 1.2695 4.7289 24.8106 56.0465 241.7881 2.2409 44.5205 2.8455 10.5508 0.3658 1.1467 73.7191 109.8682 232.0807 14.3358 39.4256 30.4840 3.6356 3.8348 3.9808 2.3561 1.1222 13.9684 29.9049 8.9719 127.6960 90.7089 67.4825 113.6964 32.8317 4.4953 63.8157 0.3371 0.5010 0.1106 0.0073 15.4319 0.6212 0.6300 108.3905 25.9407 4.4338 21.7946 2.9998 54.6712 6.1048 15.7756 42.6562 128.6219 6.1586 88.8442 12.4231 1.1664 1.8583 42.7877 70.9464 568.3728 15.7028 1.0908 12.0246 452.2295 7.2408 230.6321 17.7399 30.9557 12.0002 24.5599 0.5198 3.9461 4.1007 5.6795 21.8149 19.9707 43.3242 109.5296 21.7652
temp: 298.150 k
press: 1.00000 atm
elementType: 16 8 8 7 7 7 6 6 6 6 6 6 6 6 6 6 6 6 1 1 1 1 1 1 1 1 1 1 1 1 1
symmnumber: 1
zpe: 612022.8 jmol-1
zpe.correction: 0.233107 hartree
zpe.thermalcorrener: 0.251021 hartree
zpe.thermalcorrenthalpy: 0.251965 hartree
zpe.thermalcorrgfe: 0.185899 hartree
zpe.sumelectzpe: -1176.371320 hartree
zpe.sumelectthermal: -1176.353407 hartree
zpe.sumelectthermalent: -1176.352463 hartree
zpe.sumelectthermalfe: -1176.418529 hartree
dipole: -8.5501 -0.0564 2.8500
dipole: 9.0128
quadrupole: -97.6826 -99.9159 -120.2456
quadrupole: 2.5914 20.5628 -4.5891
quadrupole: 8.2654 6.0321 -14.2975 2.5914 20.5628 -4.5891
hfenergy: -1176.6044276 hartree
pointgroup: C01[X(C12H13N3O2S1)]
dipole: 3.371898 -0.0462333 -1.0961892 debye
polarizability: 349.7009808|-6.456186|172.7319285|17.4114487|-0.0007964|109.075166 unknown
InChI: InChI=1S/C12H13N3O2S/c13-9-1-3-10(4-2-9)15-11-5-7-12(8-6-11)18(14,16)17/h1-8,15H,13-14H2
charge 0 multiplicity 1
31 atoms
S  -4.569345 -0.539936 0.219548
O  -4.613244 -1.723118 1.343267
O  -5.523341 0.783845 0.270663
N  1.156802 1.372433 -0.308169
N  -4.956443 -1.368519 -1.392764
N  6.117477 -1.367942 0.217326
C  -0.14854 0.88969 -0.188831
C  -2.809671 0.027405 0.049631
C  2.380028 0.646134 -0.152445
C  -1.230732 1.739687 -0.582004
C  -0.445726 -0.402212 0.346552
C  -2.562552 1.313888 -0.464403
C  -1.777694 -0.833617 0.464275
C  3.469409 1.254415 0.522467
C  2.567473 -0.644674 -0.713375
C  4.894697 -0.705391 0.094249
C  4.710448 0.600209 0.634938
C  3.796903 -1.314625 -0.581952
H  1.249454 2.368615 -0.513858
H  -1.015839 2.737675 -0.982895
H  0.364225 -1.046882 0.696355
H  -3.396061 1.965788 -0.744187
H  -2.017838 -1.807743 0.902458
H  3.339205 2.245897 0.972766
H  1.754513 -1.116035 -1.275241
H  5.538216 1.094119 1.15799
H  3.916719 -2.31202 -1.022162
H  -5.188892 -2.35432 -1.181195
H  -5.747834 -0.854631 -1.817331
H  6.897371 -0.937302 0.704586
H  6.245911 -2.300232 -0.164058
