program: Gaussian 09
title: 000085554
version: EM64L-G09RevD.01
frameworkgroup: C1[X(C8H10N2O2)]
method: RPBEPBE
basis: SDD
operation: Freq
keyword: #p
keyword: freq=noraman
keyword: PBEPBE/SDD
title: #p freq=noraman PBEPBE/SDD
converged: NO YES NO YES
title: Mulliken charges:
elementType: O O N N C C C C C C C C H H H H H H H H H H
charge: -0.437563 -0.289489 -0.476609 -0.662983 0.323739 0.525967 0.173234 -0.593068 -0.375114 -0.383448 -0.857444 0.263516 0.236992 0.226880 0.306847 0.230034 0.230051 0.250526 0.291660 0.366657 0.345847 0.303768
chargesum: 0.00000
title: Mulliken charges with hydrogens summed into heavy atoms:
elementType: O O N N C C C C C C C C
charge: -0.070905 -0.289489 -0.184950 -0.013368 0.323739 0.525967 0.173234 -0.356077 -0.148234 -0.076602 -0.146833 0.263516
polarizability: 1.73162452e+02 -4.32404577e+00 1.11859170e+02 1.47615050e-03 -9.34903503e-04 4.96817706e+01
1716.lowfreq: -0.0006 -0.0003 -0.0002 5.7299 11.7513 19.0934 51.9832 62.4708 130.7518
frequency: 51.9750 62.4695 130.7433 148.4574 150.0092 225.2827 273.3702 280.0593 285.4436 302.7787 334.5204 346.4390 449.3458 452.5846 487.5259 512.3365 562.3962 580.5266 627.5918 643.4069 704.3830 712.1108 743.2161 791.7368 835.6021 859.7226 891.6032 967.9671 981.1248 1003.6487 1040.7508 1041.0696 1120.9803 1143.7360 1184.0922 1236.3030 1269.3104 1293.3056 1315.1668 1378.2981 1396.4785 1439.3791 1472.7837 1477.2022 1504.5175 1521.0548 1591.0417 1612.1212 1646.7244 1661.4780 2948.1922 3014.2208 3083.8296 3126.8624 3136.3853 3200.8445 3532.7666 3544.3082 3580.9518 3698.7012
redmass: 4.7859 4.2976 1.5065 1.5616 4.9384 3.5469 1.5394 7.4396 3.3656 1.2288 4.4599 2.3239 4.2418 2.9009 1.1345 3.9115 4.8000 1.2891 3.7767 5.2314 2.8740 6.8632 4.7044 6.0647 1.2941 1.7472 3.6866 1.3065 1.6023 2.7094 1.4857 1.9829 2.1248 1.3304 1.7067 1.6650 1.6127 3.3181 2.3427 5.2330 1.2683 3.1192 1.1730 1.0438 2.8802 2.7481 3.1838 1.4937 5.5497 4.0306 1.0401 1.0980 1.0940 1.0907 1.0920 1.0943 1.0697 1.0519 1.0655 1.1039
irintensity: 20.3073 1.1900 0.3213 0.2951 12.7315 0.0089 0.2594 1.9267 1.8405 152.3112 0.3640 11.5462 7.9741 12.7754 306.0073 11.5050 11.0608 81.8936 4.2997 0.4718 13.8481 15.7661 9.6153 4.2260 7.4438 86.3797 4.7740 4.9723 8.2733 41.9214 5.0444 26.3248 35.7824 168.6285 6.3369 44.4847 30.5031 109.1456 32.5482 357.5471 13.2353 35.5419 30.7432 14.1790 31.3605 576.4196 171.3479 23.1145 72.6099 273.0368 53.8322 27.1535 12.2809 21.1487 5.7503 6.9879 16.4735 50.4215 35.0160 41.2612
temp: 298.150 k
press: 1.00000 atm
elementType: 8 8 7 7 6 6 6 6 6 6 6 6 1 1 1 1 1 1 1 1 1 1
symmnumber: 1
zpe: 452255.6 jmol-1
zpe.correction: 0.172255 hartree
zpe.thermalcorrener: 0.184255 hartree
zpe.thermalcorrenthalpy: 0.185199 hartree
zpe.thermalcorrgfe: 0.134316 hartree
zpe.sumelectzpe: -569.943705 hartree
zpe.sumelectthermal: -569.931705 hartree
zpe.sumelectthermalent: -569.930761 hartree
zpe.sumelectthermalfe: -569.981644 hartree
dipole: 0.3554 2.9576 -0.0008
dipole: 2.9789
quadrupole: -46.6434 -69.3952 -75.4676
quadrupole: -18.0925 0.0026 -0.0003
quadrupole: 17.1920 -5.5598 -11.6322 -18.0925 0.0026 -0.0003
hfenergy: -570.1159599 hartree
pointgroup: C01 [X(C8H10N2O2)]
dipole: 0.1753908 -1.1587929 0.0001133 debye
dipolederiv: -0.8843763 0.5717552 0.0002374 0.69042 -0.662722 -0.0001723 0.0002975 -0.0001686 -0.4210679 -0.8201019 0.0414418 0.0000467 0.2597584 -0.9934908 0.0000104 0.0000329 -0.0000044 -0.3851509 -2.0834373 -0.0498172 0.0001952 0.3022959 -0.3181322 -0.000001 0.0001179 0.0000529 -0.3534059 -1.3792733 -0.4477921 0.0000477 -0.588481 -0.5070982 0.0000343 0.0000161 0.0000189 -0.793113 -0.0319337 0.0526129 -0.0000106 0.3244467 -0.2817819 -0.0001122 0.0000368 -0.0000608 -0.1108088 1.4151486 0.1662072 -0.0002039 0.577332 0.2746492 -0.0000223 -0.0001227 0.0000421 0.1113123 0.8867486 -0.4597026 -0.0002743 -0.6783115 0.6223725 0.0002524 -0.000355 0.0002128 0.0741589 -0.5725797 0.1096305 0.0000731 0.0650672 -0.025889 0.0000442 0.0000434 0.0000296 -0.2467516 0.2592846 -0.0174355 -0.0000949 -0.0145721 0.1535452 0.0000678 -0.0000803 0.0000584 -0.1416894 -0.4049837 -0.0570129 0.0000263 -0.3403993 -0.2067853 0.0000552 0.0000223 -0.0000093 -0.2004648 -0.0368344 -0.0176919 0.0000339 -0.0054467 0.0283266 -0.0000255 0.0000614 -0.0000207 0.1138346 2.6749104 0.2398775 -0.000175 -0.3812253 1.3987416 -0.0000118 -0.0002292 -0.0000609 0.3401424 0.0632682 -0.0729571 0.0000132 -0.0650819 -0.0716265 -0.0000482 0.0000225 -0.0000486 0.1830264 0.0568894 -0.0657197 0.0000007 -0.0614094 -0.1058187 -0.0000403 -0.0000009 -0.000038 0.1442537 0.1488092 0.060934 0.0000318 0.0470999 0.0829366 -0.0000332 0.0000332 -0.0000172 0.190905 -0.0829612 -0.0086955 -0.0769767 0.0516378 0.0672822 0.0938544 -0.1313383 0.0515083 -0.0530229 -0.082865 -0.0087728 0.076977 0.0515009 0.0673777 -0.0937958 0.131373 -0.0514299 -0.0531966 0.0990189 0.0476416 0.0000174 -0.080333 -0.1201857 -0.0000533 -0.0000178 -0.0000725 0.1177336 0.1122533 0.0185201 0.0000132 -0.0063524 0.0703475 -0.0000114 0.0000493 -0.0000264 0.3182802 0.2283315 -0.135695 -0.0000158 -0.16154 0.2752667 -0.0000043 -0.0000435 0.0000118 0.3523497 0.2466376 0.0086493 0.0000169 -0.0183456 0.1606008 0.0000055 0.0000478 0.0000056 0.4032936 0.1880464 0.0240223 0.0000206 0.0319396 0.0920836 0.0000075 0.0000335 0.0000171 0.4093813 unknown
polarizability: 172.8403508|6.1918766|112.181267|-0.0189958|0.0084851|49.6817749 unknown
InChI: InChI=1S/C8H10N2O2/c1-5-2-3-6(4-7(5)11)10-8(9)12/h2-4,10-11H,9H2,1H3
charge 0 multiplicity 1
22 atoms
O  2.892513 -1.77131 -0.001347
O  -3.08953 1.242004 -0.000076
N  -1.80719 -0.748813 -0.000119
N  -4.150716 -0.827527 0.000016
C  2.254475 0.624863 -0.00067
C  -0.478931 -0.237882 -0.000273
C  1.912479 -0.757076 -0.0009
C  0.573689 -1.188955 -0.000707
C  1.181308 1.545638 -0.000266
C  -0.172223 1.148919 -0.000064
C  3.707004 1.06831 -0.000894
C  -3.008393 -0.021364 -0.000085
H  0.375134 -2.267029 -0.000928
H  1.412337 2.617921 -0.000099
H  -0.982377 1.878763 0.000217
H  4.257098 0.714025 0.895217
H  4.256649 0.714531 -0.897476
H  3.774347 2.168869 -0.000589
H  -1.875245 -1.768102 -0.000156
H  3.800136 -1.377533 -0.001375
H  -5.044116 -0.342149 0.000116
H  -4.141749 -1.845104 0.000059
