program: Gaussian 09
title: 000085514
version: EM64L-G09RevD.01
frameworkgroup: C1[X(C15H13NO)]
method: RPBEPBE
basis: SDD
operation: Freq
keyword: #p
keyword: freq=noraman
keyword: PBEPBE/SDD
title: #p freq=noraman PBEPBE/SDD
converged: YES YES NO NO
title: Mulliken charges:
elementType: O N C C C C C C C C C C C C C C C H H H H H H H H H H H H H
charge: -0.218012 -0.237657 0.314994 0.224545 0.299048 -0.535623 0.296913 -0.369902 -0.418391 -0.216774 -0.253035 -0.389634 -0.375100 -0.237695 -0.239229 -0.242897 -0.510951 0.260060 0.250706 0.238614 0.222526 0.221277 0.239480 0.273486 0.225879 0.227116 0.229924 0.235260 0.238284 0.246788
chargesum: 0.00000
title: Mulliken charges with hydrogens summed into heavy atoms:
elementType: O N C C C C C C C C C C C C C C C
charge: -0.218012 -0.237657 0.314994 0.224545 0.299048 -0.275563 0.296913 -0.119196 -0.179777 0.005752 -0.031758 -0.150154 -0.101615 -0.011816 -0.012113 -0.012974 0.209381
polarizability: 3.11339944e+02 -6.32384344e+00 1.66626069e+02 -8.67941920e-01 -1.54787907e+01 8.55996511e+01
1716.lowfreq: -7.1462 -3.6033 -0.0008 -0.0006 -0.0002 4.7419 44.6234 57.1792 73.3937
frequency: 44.5108 57.1730 73.3854 82.7964 111.2804 165.1501 183.7777 220.2589 264.6109 275.4374 293.1983 338.9249 403.6482 405.6515 432.8938 488.3454 530.3681 565.7523 572.8454 596.5632 614.2541 632.3737 662.6465 695.9126 700.0424 743.0424 746.9027 769.6641 803.9958 817.6318 853.1374 856.9259 879.3045 892.6316 925.8728 936.5814 972.8830 979.4152 987.4136 996.0409 1006.7984 1013.7568 1035.5680 1081.1885 1101.3533 1101.4680 1136.4877 1150.3621 1163.0366 1173.3824 1193.3116 1196.6379 1235.6936 1297.2798 1317.8067 1326.3220 1340.5140 1376.6185 1406.8636 1413.8914 1436.4858 1445.3849 1452.2181 1465.1566 1466.8455 1482.6509 1544.7198 1580.5029 1584.0863 1614.1987 1623.8233 2985.2183 3093.6538 3125.4037 3126.7445 3130.5499 3134.1970 3138.7462 3147.8543 3153.8967 3161.5487 3167.3503 3175.2170 3212.5494
redmass: 3.7504 4.5903 3.2730 3.5686 4.2437 1.1927 3.7915 4.2698 5.1157 5.2139 5.4340 4.8117 3.0326 3.9622 3.0391 3.9265 4.4950 5.1296 4.4082 5.8238 5.9068 3.2774 6.3209 3.8858 2.2378 1.5267 2.0989 1.7677 1.6826 4.6061 1.2585 1.4724 6.9688 6.0272 1.4502 1.3760 1.2992 1.4175 5.5648 1.3149 2.1545 4.4121 2.2207 1.6325 1.9212 1.2752 1.7036 1.5150 1.1154 1.0593 1.4959 1.3162 2.2212 2.3961 3.8558 1.7085 2.2658 6.9931 2.4922 1.2803 2.4984 1.0761 4.1491 2.5908 1.0633 2.8522 5.9804 6.1079 6.7581 6.0242 7.8190 1.0282 1.1066 1.0847 1.0851 1.1039 1.0884 1.0897 1.0939 1.0951 1.0981 1.0997 1.0973 1.0970
irintensity: 0.5045 1.0335 5.1053 1.2933 2.5412 0.0897 0.3693 2.8109 4.9975 1.5806 3.5355 2.2131 0.2779 3.3414 5.5207 7.0810 5.5710 6.5487 0.2329 9.8565 1.7984 2.1558 1.3903 9.7577 36.2624 3.2043 60.1676 109.7521 32.7434 0.8506 0.2603 2.8271 15.3716 2.7189 4.0155 4.6541 0.0575 0.3806 0.3894 0.5291 7.0876 7.9587 14.0990 9.8440 0.9386 0.2103 2.5323 4.8033 1.7296 0.0308 6.8540 3.4343 9.9909 0.7332 15.9769 6.4863 9.1658 2.2330 30.0937 9.4669 5.7487 12.6928 6.7409 9.6630 6.8674 17.3440 8.3819 1.3054 0.8724 29.1734 1.1396 30.1073 21.5187 2.9170 0.6831 13.5453 6.6098 10.2278 30.7016 29.0620 31.1344 30.5097 8.4474 3.8822
temp: 298.150 k
press: 1.00000 atm
elementType: 8 7 6 6 6 6 6 6 6 6 6 6 6 6 6 6 6 1 1 1 1 1 1 1 1 1 1 1 1 1
symmnumber: 1
zpe: 622600.0 jmol-1
zpe.correction: 0.237136 hartree
zpe.thermalcorrener: 0.251198 hartree
zpe.thermalcorrenthalpy: 0.252142 hartree
zpe.thermalcorrgfe: 0.195649 hartree
zpe.sumelectzpe: -708.138344 hartree
zpe.sumelectthermal: -708.124282 hartree
zpe.sumelectthermalent: -708.123338 hartree
zpe.sumelectthermalfe: -708.179831 hartree
dipole: -1.1195 1.0069 1.8959
dipole: 2.4211
quadrupole: -89.2237 -87.2847 -102.7628
quadrupole: 0.5225 -0.0236 0.3815
quadrupole: 3.8667 5.8057 -9.6724 0.5225 -0.0236 0.3815
hfenergy: -708.3754798 hartree
pointgroup: C01 [X(C15H13N1O1)]
dipole: 0.4428997 0.6812353 -0.4970607 debye
polarizability: 311.4694412|4.7119474|138.326466|0.7285356|41.5230934|113.7697572 unknown
InChI: InChI=1S/C15H13NO/c1-17-16-14-10-6-5-9-13(14)11-15(16)12-7-3-2-4-8-12/h2-11H,1H3
charge 0 multiplicity 1
30 atoms
O  -0.095858 1.815917 1.041355
N  -0.52204 0.579382 0.468328
C  0.318241 -0.374807 -0.161674
C  -1.871263 0.274536 0.266347
C  -1.898842 -0.952558 -0.489572
C  -0.529379 -1.331695 -0.74462
C  1.787778 -0.330317 -0.128279
C  -3.037283 0.947911 0.685677
C  -3.161119 -1.520894 -0.812191
C  -4.272338 0.363931 0.337271
C  -4.33277 -0.857539 -0.400634
C  2.526194 -0.979111 -1.160236
C  2.508548 0.310693 0.921168
C  3.935006 -0.995698 -1.14026
C  3.919601 0.297554 0.931746
C  4.641575 -0.354829 -0.094406
C  0.082071 2.848245 -0.027131
H  -0.192313 -2.238961 -1.243776
H  -2.98068 1.871718 1.269429
H  -3.219802 -2.459723 -1.374051
H  -5.204119 0.850984 0.645675
H  -5.312215 -1.28319 -0.645588
H  1.987037 -1.455163 -1.986685
H  1.958923 0.803729 1.727791
H  4.483144 -1.499623 -1.944218
H  4.45655 0.790923 1.749804
H  5.737003 -0.363854 -0.080817
H  0.344394 3.763094 0.526169
H  -0.860402 2.986101 -0.585811
H  0.902058 2.556843 -0.706411
