program: Gaussian 09
title: 000085528
version: EM64L-G09RevD.01
frameworkgroup: C1[X(C14H22O4)]
method: RPBEPBE
basis: SDD
operation: Freq
keyword: #pfreq=noraman
keyword: PBEPBE/SDD
title: #p freq=noraman PBEPBE/SDD
converged: YES YES NO NO
title: Mulliken charges:
elementType: O O O O C C C C C C C C C C C C C C H H H H H H H H H H H H H H H H H H H H H H
charge: -0.258647 -0.217991 -0.217995 -0.258643 0.017641 0.017654 -0.328155 -0.297603 -0.297610 -0.328156 -0.045113 -0.051935 -0.051929 -0.045112 -0.558042 -0.559708 -0.559712 -0.558040 0.161640 0.161632 0.194784 0.189897 0.227534 0.179162 0.227534 0.179166 0.194781 0.189895 0.234002 0.238751 0.238748 0.234001 0.222465 0.215621 0.219075 0.216623 0.219073 0.216626 0.222465 0.215620
chargesum: 0.00000
title: Mulliken charges with hydrogens summed into heavy atoms:
elementType: O O O O C C C C C C C C C C C C C C
charge: -0.258647 -0.217991 -0.217995 -0.258643 0.179281 0.179286 0.056527 0.109093 0.109089 0.056520 0.188889 0.186816 0.186820 0.188889 -0.119956 -0.124010 -0.124013 -0.119955
polarizability: 1.79877961e+02 -4.22256660e-03 1.78737950e+02 1.39390633e+01 2.55718300e-03 1.62548360e+02
1716.lowfreq: -3.1654 -0.0004 0.0002 0.0003 4.3691 6.8120 18.1654 22.1769 26.2663
frequency: 18.1025 22.1455 26.2471 31.1648 36.9927 41.3215 41.5340 48.5789 52.1043 81.1473 81.6385 93.5696 98.9521 138.6391 155.9404 199.7097 208.0875 238.1077 238.7650 251.3895 277.0590 285.2591 382.1595 395.9083 403.2612 423.9792 435.5514 480.5835 538.3713 538.3792 607.9487 628.5872 636.6062 663.7201 729.6481 869.8523 873.6821 891.0684 913.6584 914.8797 921.9084 926.2803 949.0336 949.0612 951.8410 952.0932 960.7515 967.1794 969.2121 977.9269 981.7692 982.9770 991.8202 1001.9176 1009.9571 1012.7464 1013.0222 1019.6074 1089.9856 1138.0069 1145.3737 1146.1479 1147.3706 1152.2945 1208.7077 1209.5968 1213.3770 1214.0294 1278.5388 1278.5756 1279.8714 1279.8818 1299.0617 1302.4088 1316.9487 1320.3484 1353.7612 1361.9285 1372.2417 1380.9394 1431.4404 1431.6361 1433.2506 1433.3816 1468.1104 1468.7305 1471.4448 1471.7700 1664.7931 1664.9968 1665.7753 1665.7906 2847.6472 2856.4310 2899.8263 2900.6940 2903.5981 2904.7053 2970.6809 2970.8530 3031.7348 3031.7419 3091.0455 3091.0499 3091.2935 3091.3004 3119.6916 3119.7535 3122.9666 3122.9785 3201.2275 3201.2351 3202.0126 3202.0690
redmass: 4.2798 4.2375 4.5114 3.5784 2.1394 2.4879 1.9209 2.9414 2.0581 2.9722 3.2201 3.0154 3.1196 4.0179 3.3101 3.4394 2.9085 5.3612 4.9187 3.5518 3.6171 4.4063 3.0056 2.6075 2.5158 2.6020 2.4454 3.6616 2.2725 2.6317 1.6784 1.6013 1.7665 2.1688 3.5910 3.3397 4.5894 4.1114 1.7194 1.9001 1.7666 1.6507 1.4137 1.4157 1.3327 1.3400 2.3461 2.0023 2.8928 3.8043 1.7698 1.7026 3.2876 1.4643 1.2294 1.3417 1.3332 1.7518 4.5260 2.4945 1.6786 1.6715 1.6523 2.0146 1.2544 1.2753 1.2530 1.2717 1.2381 1.2426 1.2360 1.2372 1.1119 1.2212 1.2174 1.2233 1.2553 1.5270 1.2612 1.3164 1.1963 1.2019 1.2050 1.2088 1.0938 1.0935 1.0915 1.0918 4.7857 4.7837 4.8240 4.8261 1.0800 1.0817 1.0612 1.0624 1.0647 1.0645 1.0996 1.0988 1.0931 1.0930 1.0605 1.0606 1.0606 1.0606 1.0945 1.0945 1.0946 1.0946 1.1142 1.1142 1.1142 1.1141
irintensity: 0.0859 0.0016 0.4422 0.2366 0.3058 0.0668 3.9411 0.2392 3.3520 0.0029 1.0977 0.0024 1.0933 0.6104 0.3620 14.9007 1.1980 14.5320 0.1571 0.1456 14.1449 2.1143 0.6559 0.0272 0.6508 0.9626 3.2769 1.1704 3.5515 6.2859 16.0267 3.8247 16.0290 4.6395 1.9455 7.2820 168.3191 85.6695 11.4558 21.9787 35.0590 64.4079 0.4381 14.7944 133.1451 218.4670 66.1356 92.7536 110.9390 155.4946 64.7085 12.9260 163.2204 0.0065 83.3616 0.0134 6.3695 29.9969 93.7786 50.9355 0.0421 7.1166 3.2721 80.0474 11.4132 1.2276 4.0657 0.3554 0.1003 0.5320 0.8980 0.1292 19.0616 25.3364 62.9751 19.9019 13.8463 9.2287 2.9039 21.5418 22.9833 1.6799 22.2029 12.8259 1.0180 8.0589 0.2865 10.2976 9.1768 2.3746 3.6264 6.1664 49.3575 80.9139 10.4104 5.9665 81.9655 136.9991 84.3333 26.9190 46.3104 6.8725 5.3746 16.0017 9.9537 11.9571 13.2286 2.0309 2.6820 11.8240 18.8732 32.1638 50.4095 4.2528
temp: 298.150 k
press: 1.00000 atm
elementType: 8 8 8 8 6 6 6 6 6 6 6 6 6 6 6 6 6 6 1 1 1 1 1 1 1 1 1 1 1 1 1 1 1 1 1 1 1 1 1 1
symmnumber: 1
zpe: 862917.0 jmol-1
zpe.correction: 0.328668 hartree
zpe.thermalcorrener: 0.351312 hartree
zpe.thermalcorrenthalpy: 0.352256 hartree
zpe.thermalcorrgfe: 0.270443 hartree
zpe.sumelectzpe: -845.981788 hartree
zpe.sumelectthermal: -845.959143 hartree
zpe.sumelectthermalent: -845.958199 hartree
zpe.sumelectthermalfe: -846.040013 hartree
dipole: -0.0003 -4.3195 -0.0012
dipole: 4.3195
quadrupole: -96.1651 -104.2800 -106.1682
quadrupole: 0.0004 -3.4676 -0.0002
quadrupole: 6.0394 -2.0756 -3.9638 0.0004 -3.4676 -0.0002
hfenergy: -846.3104556 hartree
pointgroup: C01 [X(C14H22O4)]
dipole: -0.0000033 0.0006424 -1.6994192 debye
polarizability: 170.5394392|16.3988522|171.8868818|0.0050575|-0.00255|178.7379488 unknown
InChI: InChI=1S/C14H22O4/c1-5-9-15-13(16-10-6-2)14(17-11-7-3)18-12-8-4/h5-8,13-14H,1-4,9-12H2
charge 0 multiplicity 1
40 atoms
O  -1.199492 -1.444877 -0.471675
O  0.626853 -1.185132 1.019296
O  -0.626897 1.184329 1.020336
O  1.199483 1.445458 -0.470341
C  0.09555 -0.766728 -0.230391
C  -0.095548 0.767057 -0.229708
C  -1.411031 -1.844355 -1.878935
C  1.033184 -2.611395 1.024263
C  -1.033367 2.610547 1.026557
C  1.411144 1.845979 -1.877286
C  -2.588156 -2.78381 -1.918365
C  1.835812 -2.853399 2.274409
C  -1.836023 2.851357 2.276913
C  2.588193 2.785559 -1.915911
C  -3.635502 -2.661828 -2.769705
C  1.630365 -3.893232 3.118891
C  -1.630718 3.890454 3.122335
C  3.635671 2.664233 -2.767184
H  0.786394 -1.033022 -1.072903
H  -0.786368 1.034085 -1.07201
H  -1.597877 -0.95983 -2.524831
H  -0.493651 -2.357666 -2.252536
H  0.136068 -3.256761 0.980954
H  1.655845 -2.802602 0.117834
H  -0.136317 3.256043 0.983817
H  -1.656051 2.802488 0.120299
H  1.598131 0.961937 -2.523801
H  0.49376 2.359484 -2.250611
H  -2.545251 -3.613849 -1.200057
H  2.635779 -2.125335 2.464984
H  -2.635908 2.12303 2.466832
H  2.545114 3.615107 -1.197048
H  -4.453874 -3.389594 -2.77853
H  -3.707205 -1.829527 -3.481229
H  2.262188 -4.048413 4.000075
H  0.821107 -4.616313 2.956772
H  -2.262578 4.044752 4.003647
H  -0.821552 4.613791 2.960898
H  4.453987 3.392067 -2.775402
H  3.70754 1.83241 -3.479252
