program: Gaussian 09
title: 000085466
version: EM64L-G09RevD.01
frameworkgroup: C1[X(C14H10N2O4)]
method: RPBEPBE
basis: SDD
operation: Freq
keyword: #p
keyword: freq=noraman
keyword: PBEPBE/SDD
title: #p freq=noraman PBEPBE/SDD
converged: NO YES NO NO
title: Mulliken charges:
elementType: O O O O N N C C C C C C C C C C C C C C H H H H H H H H H H
charge: -0.283608 -0.470509 -0.371082 -0.396066 -0.668137 -0.661591 0.128590 0.192926 0.200793 0.133687 -0.137507 0.023175 0.294811 0.289660 0.134243 0.082159 -0.416440 -0.421583 -0.381696 -0.351437 0.226631 0.227484 0.219721 0.260685 0.389852 0.299658 0.402214 0.303718 0.352384 0.397264
chargesum: 0.00000
title: Mulliken charges with hydrogens summed into heavy atoms:
elementType: O O O O N N C C C C C C C C C C C C C C
charge: -0.283608 -0.470509 -0.018697 0.001197 0.021373 0.044341 0.128590 0.192926 0.200793 0.133687 -0.137507 0.023175 0.294811 0.289660 0.134243 0.082159 -0.189809 -0.194099 -0.161975 -0.090752
polarizability: 3.71843788e+02 3.77009408e-01 2.36266769e+02 3.33779941e-03 9.64228159e-03 6.94148016e+01
1716.lowfreq: -8.0630 -6.3484 -2.3730 -0.0008 -0.0007 -0.0002 47.7600 63.3625 116.7321
frequency: 47.7410 63.3572 116.7316 141.1033 151.6428 194.0937 202.6248 251.3820 290.5937 310.4867 345.9600 354.9871 376.4652 395.3350 406.0182 418.2167 425.4858 440.0381 452.9152 456.5177 461.2591 468.0589 479.8500 491.0770 507.1841 529.6331 541.7794 579.0182 601.1009 664.3342 692.3538 729.7231 730.0320 753.8690 799.2952 808.5317 815.7519 828.3019 833.4928 841.1289 847.6984 930.2788 934.4869 949.6883 955.3035 969.3167 996.3599 1047.3968 1084.9657 1145.7998 1159.8468 1178.1322 1197.5921 1248.0184 1273.0091 1282.2688 1290.8027 1325.4074 1339.6284 1359.2719 1395.5111 1406.3298 1418.3171 1444.8525 1458.2922 1467.2888 1499.3578 1540.0465 1548.8100 1562.6255 1567.1409 1598.6484 1627.4337 1649.9220 2587.7553 3111.9761 3119.2998 3144.6618 3178.9814 3201.9275 3263.2056 3525.9110 3616.4722 3623.3852
redmass: 6.5497 6.4631 6.7266 5.0337 8.2077 7.4202 5.8745 4.8375 5.9286 5.9634 4.4795 5.3393 3.8625 1.1663 11.4935 6.1100 6.6588 9.5952 7.5905 1.2601 3.9570 1.2044 6.1969 8.7711 3.7029 7.2579 3.7100 4.0562 3.0537 5.7268 6.5167 6.4347 7.3923 5.3711 8.5798 1.5799 1.6823 1.1402 8.4795 11.4604 1.0914 1.3436 6.4745 1.3440 5.1628 4.1540 1.0624 1.9706 1.6189 1.5359 1.4206 1.2555 2.1096 2.9844 3.9076 2.4289 3.5336 3.4508 2.5340 6.4073 3.7202 7.8629 3.7320 3.6796 3.4148 2.9417 2.6817 4.5151 4.1776 1.8230 2.4114 3.2030 2.7081 7.0545 1.0712 1.0900 1.0864 1.0981 1.0949 1.0644 1.0622 1.0655 1.0879 1.0895
irintensity: 7.1570 2.3918 0.1600 3.2609 0.2536 4.1681 1.6493 3.5032 5.3102 1.7987 0.2348 0.3175 6.2343 104.0018 2.4480 8.0483 0.0643 0.8592 22.1362 8.8902 3.2433 236.3119 6.0483 9.6031 0.0451 5.0002 45.8877 1.3583 12.7894 1.5328 4.4047 1.5292 8.2232 27.8272 23.7135 10.3511 194.1469 8.4346 10.4727 0.0282 104.6439 2.7906 72.6280 0.0227 21.5421 12.8354 157.8488 23.2196 7.2907 43.1912 52.9417 19.0799 70.5965 53.4581 53.0952 303.9906 339.0175 106.0558 81.2979 116.8227 105.4013 25.2465 17.4408 99.9896 33.6404 132.1466 73.6123 162.5315 282.1782 84.3296 172.7833 176.5217 69.0672 101.8208 172.1573 20.8367 8.8965 32.3466 6.2677 29.6045 45.9980 37.0964 65.9930 78.9714
temp: 298.150 k
press: 1.00000 atm
elementType: 8 8 8 8 7 7 6 6 6 6 6 6 6 6 6 6 6 6 6 6 1 1 1 1 1 1 1 1 1 1
symmnumber: 1
zpe: 568650.2 jmol-1
zpe.correction: 0.216587 hartree
zpe.thermalcorrener: 0.232066 hartree
zpe.thermalcorrenthalpy: 0.233010 hartree
zpe.thermalcorrgfe: 0.174962 hartree
zpe.sumelectzpe: -948.560133 hartree
zpe.sumelectthermal: -948.544654 hartree
zpe.sumelectthermalent: -948.543710 hartree
zpe.sumelectthermalfe: -948.601758 hartree
dipole: -3.4100 0.6530 0.0004
dipole: 3.4719
quadrupole: -73.2157 -113.8176 -119.7827
quadrupole: 11.7507 0.0024 -0.0020
quadrupole: 29.0563 -11.5456 -17.5107 11.7507 0.0024 -0.0020
hfenergy: -948.7767202 hartree
pointgroup: C01 [X(C14H10N2O4)]
dipole: -1.345931 -0.2330939 -0.00016 debye
polarizability: 371.787773|-2.7808907|236.3227845|-0.0031663|0.0097|69.4148016 unknown
InChI: InChI=1S/C14H10N2O4/c15-5-1-2-6(16)10-9(5)13(19)11-7(17)3-4-8(18)12(11)14(10)20/h1-4,17-18H,15-16H2
charge 0 multiplicity 1
30 atoms
O  -0.035245 -2.800568 0.000006
O  0.039552 2.748269 0.000894
O  2.608439 -2.818253 0.000367
O  2.506573 2.800039 -0.000004
N  -2.596669 -2.808011 0.000175
N  -2.529367 2.823996 0.000761
C  -1.274959 -0.733647 0.00062
C  -1.268592 0.711903 0.000735
C  1.270678 -0.763082 0.000652
C  1.258213 0.678267 0.000649
C  -0.015489 -1.504372 0.000945
C  -0.002957 1.418986 0.00102
C  -2.530328 -1.43395 0.000274
C  -2.505748 1.448874 0.000552
C  2.535206 -1.421556 0.000371
C  2.486619 1.42656 0.000291
C  -3.751757 -0.670187 0.000064
C  -3.742256 0.715988 0.000208
C  3.739978 -0.661071 0.000118
C  3.725063 0.73721 0.000083
H  -4.706846 -1.209461 -0.000174
H  -4.687464 1.271782 0.000092
H  4.703767 -1.18805 -0.000102
H  4.648378 1.322273 -0.0002
H  -1.680003 -3.297851 0.000442
H  -3.496318 -3.284023 -0.000022
H  -1.607469 3.295738 0.001277
H  -3.414134 3.326817 0.000655
H  3.560427 -3.099604 0.000177
H  1.500507 3.096582 -0.000326
