program: Gaussian 09
title: 000085454
version: EM64L-G09RevD.01
frameworkgroup: C1[X(C10H16O2)]
method: RPBEPBE
basis: SDD
operation: Freq
keyword: #pfreq=noraman
keyword: PBEPBE/SDD
title: #p freq=noraman PBEPBE/SDD
converged: YES YES NO NO
title: Mulliken charges:
elementType: O O C C C C C C C C C C H H H H H H H H H H H H H H H H
charge: -0.255645 -0.248794 -0.406954 -0.504271 -0.495694 0.387759 -0.378507 -0.296365 0.163979 -0.481799 -0.343199 -0.685213 0.213530 0.220197 0.235844 0.244017 0.246757 0.225088 0.210494 0.210611 0.213791 0.215353 0.270441 0.196396 0.196624 0.212516 0.212625 0.220421
chargesum: 0.00000
title: Mulliken charges with hydrogens summed into heavy atoms:
elementType: O O C C C C C C C C C C
charge: -0.255645 -0.248794 0.026773 -0.024410 -0.023850 0.387759 0.042598 0.132779 0.163979 -0.211359 0.049820 -0.039651
polarizability: 1.56121030e+02 1.08558650e+01 1.15829471e+02 4.86125275e-01 -1.85933009e+00 7.90360733e+01
1716.lowfreq: -11.0303 -9.0272 -0.0007 0.0005 0.0007 7.6617 36.7524 57.2088 68.4319
frequency: 36.6713 57.0381 68.3096 93.6187 116.0779 164.1036 186.4280 193.1439 232.2713 240.4311 267.9319 363.3406 422.9538 437.1913 474.3469 506.9567 533.1954 586.5705 642.0544 741.9485 753.8275 808.4247 842.6532 865.0351 877.7357 894.2033 909.9132 938.7647 943.8797 964.3536 1039.7596 1055.7698 1075.8521 1083.3792 1122.6139 1130.8189 1145.1602 1167.8459 1195.9945 1213.5237 1238.7634 1271.5637 1273.4512 1279.9908 1288.7986 1310.2305 1316.2668 1342.3276 1347.8754 1363.2251 1387.7921 1394.1537 1440.9583 1453.4767 1469.2318 1472.2886 1473.8220 1478.3180 1480.9137 1490.6845 1576.2454 1609.2813 2964.8283 2969.8775 2972.0695 2976.6995 2977.0653 2995.4406 2996.3661 3012.6763 3024.9733 3050.1273 3058.2629 3061.9911 3069.0296 3075.7635 3078.2393 3161.3353
redmass: 3.2785 1.8207 3.8025 2.5575 2.6246 2.5070 3.8807 4.4262 1.1532 2.1717 2.9319 3.5834 2.9614 4.1370 3.2347 3.7789 3.1734 3.6164 3.7144 1.0764 2.3451 1.1499 1.6359 1.8831 2.1715 2.3966 1.8609 1.1613 3.5114 2.5303 3.3328 2.0020 1.7657 2.1830 2.3536 1.2858 1.4687 2.2184 2.0484 1.3621 1.2591 1.7984 1.2835 1.1609 1.0767 1.6496 1.5875 1.6132 1.5138 1.5840 1.7720 1.3045 1.0893 1.0953 1.0795 1.0693 1.0884 1.0427 1.0666 1.0917 9.7151 6.5458 1.0560 1.0587 1.0668 1.0655 1.0364 1.0591 1.0611 1.1004 1.1063 1.0942 1.1004 1.1048 1.0965 1.1018 1.0994 1.0909
irintensity: 0.0003 1.4267 1.4492 1.9863 1.1149 0.4410 3.8751 4.5624 0.1146 1.6374 0.9734 4.1397 2.7217 2.7533 3.0965 5.8436 3.7139 12.5570 7.3719 10.7237 6.5289 1.5094 10.0800 20.0317 19.2758 8.4007 22.7987 0.0937 58.6079 2.2669 12.3092 3.0079 5.7404 6.5860 32.4057 57.7476 7.1644 215.7746 29.7530 0.0409 25.5525 22.2916 1.8516 0.1916 0.1656 9.2764 38.0953 47.8095 5.6684 65.9221 11.6780 14.6760 13.4762 21.8541 2.0606 0.8299 14.7830 13.5377 8.9315 21.8192 123.9440 406.0443 6.2801 36.4623 15.2440 16.8473 31.7069 37.0684 39.6625 10.9074 5.2834 22.1757 37.5551 16.0387 22.6696 108.2133 46.2984 9.5481
temp: 298.150 k
press: 1.00000 atm
elementType: 8 8 6 6 6 6 6 6 6 6 6 6 1 1 1 1 1 1 1 1 1 1 1 1 1 1 1 1
symmnumber: 1
zpe: 631619.3 jmol-1
zpe.correction: 0.240571 hartree
zpe.thermalcorrener: 0.253567 hartree
zpe.thermalcorrenthalpy: 0.254511 hartree
zpe.thermalcorrgfe: 0.200072 hartree
zpe.sumelectzpe: -540.151558 hartree
zpe.sumelectthermal: -540.138562 hartree
zpe.sumelectthermalent: -540.137618 hartree
zpe.sumelectthermalfe: -540.192057 hartree
dipole: -3.3246 -3.2198 0.2134
dipole: 4.6331
quadrupole: -74.1856 -81.8902 -72.2163
quadrupole: -16.6890 1.0142 0.0462
quadrupole: 1.9117 -5.7928 3.8810 -16.6890 1.0142 0.0462
hfenergy: -540.3921293 hartree
pointgroup: C01 [X(C10H16O2)]
dipole: 1.3572849 -1.1260067 0.4609427 debye
polarizability: 156.5766151|-6.8168567|110.7637166|8.1024944|-11.7102217|83.6462428 unknown
InChI: InChI=1S/C10H16O2/c1-2-3-7-12-10-6-4-5-9(11)8-10/h8H,2-7H2,1H3
charge 0 multiplicity 1
28 atoms
O  0.767815 -0.83226 0.070697
O  -3.082057 1.833208 -1.179786
C  -2.866458 -1.43053 0.564204
C  -1.412523 -1.821391 0.214989
C  -3.462187 -0.492282 -0.508826
C  -0.586571 -0.597271 -0.11405
C  3.131837 -0.282442 0.008386
C  1.725691 0.256503 -0.254076
C  -2.581003 0.739317 -0.766691
C  -1.134843 0.589876 -0.549932
C  4.21808 0.781372 -0.279458
C  5.643389 0.249026 -0.019005
H  -3.48506 -2.341642 0.662011
H  -2.879964 -0.918879 1.545823
H  -1.399639 -2.506115 -0.657896
H  -0.927998 -2.364303 1.046692
H  -4.470883 -0.139274 -0.232263
H  -3.566101 -1.036425 -1.471184
H  3.302225 -1.17502 -0.623559
H  3.201742 -0.614878 1.061751
H  1.500424 1.133013 0.38639
H  1.590486 0.547238 -1.315402
H  -0.527161 1.472601 -0.772074
H  4.036965 1.67534 0.351378
H  4.136381 1.119269 -1.332533
H  5.761658 -0.069152 1.033666
H  5.864848 -0.624124 -0.660783
H  6.404705 1.022624 -0.226267
