program: Gaussian 09
title: 000085444
version: EM64L-G09RevD.01
frameworkgroup: C1[X(C10H10O4)]
method: RPBEPBE
basis: SDD
operation: Freq
keyword: #pfreq=noraman
keyword: PBEPBE/SDD
title: #p freq=noraman PBEPBE/SDD
converged: YES YES NO NO
title: Mulliken charges:
elementType: O O O O C C C C C C C C C C H H H H H H H H H H
charge: -0.370650 -0.291096 -0.223090 -0.215842 0.331140 0.134986 -0.432247 0.180536 -0.316595 -0.403803 0.114611 0.172282 -0.789376 -0.498399 0.322562 0.247337 0.224225 0.263748 0.235949 0.235803 0.361261 0.241503 0.240760 0.234393
chargesum: 0.00000
title: Mulliken charges with hydrogens summed into heavy atoms:
elementType: O O O O C C C C C C C C C C
charge: -0.009388 -0.291096 -0.223090 -0.215842 0.331140 0.134986 -0.109685 0.180536 -0.069259 -0.179577 0.114611 0.172282 -0.053876 0.218257
polarizability: 1.73875175e+02 -6.26816017e+00 1.49836063e+02 -9.60804001e-01 -4.44995208e-01 5.88975758e+01
1716.lowfreq: -6.6896 -0.0009 -0.0006 -0.0004 1.9086 6.5051 20.9185 51.6034 95.9704
frequency: 20.4594 51.6014 95.9666 103.1914 110.7436 118.8043 160.6413 185.3219 206.4492 280.6832 295.6018 301.9255 328.2733 378.7621 417.1031 446.6427 451.6972 507.6685 520.8997 556.6781 603.3356 654.5134 694.3442 705.4688 764.9937 768.1681 812.0769 841.6813 927.1726 947.1244 967.1015 985.0593 1028.6901 1038.4696 1084.2550 1109.6727 1114.5003 1145.9410 1176.0759 1208.6766 1265.3378 1271.8173 1295.1067 1367.6308 1393.8279 1411.7531 1424.2219 1448.8928 1452.3028 1464.4498 1465.5391 1495.6879 1573.2418 1596.2970 1615.0442 1639.8305 2984.1350 3002.4186 3068.3196 3102.5392 3116.1149 3125.9863 3147.6820 3159.5201 3181.6497 3544.9648
redmass: 7.2074 4.2460 4.5846 2.3154 3.6630 1.5220 1.0560 4.2334 4.4675 6.4407 5.5901 3.8420 5.9894 9.3645 1.3412 2.9412 3.6775 3.3416 3.8118 4.8979 2.9092 6.6821 5.5146 5.1238 5.8008 4.2303 1.5620 6.9781 5.5790 1.3748 2.0587 1.3998 1.8331 4.4829 2.4814 1.8054 1.2645 1.4712 1.1539 2.7574 3.0003 2.8299 1.7258 1.2914 4.1632 5.8603 1.2103 1.1019 1.0499 1.0512 1.0495 2.7922 6.8624 6.7130 8.0162 9.6385 1.0376 1.0297 1.0970 1.1043 1.0894 1.0989 1.1045 1.0945 1.0916 1.0659
irintensity: 3.8434 5.5915 1.0122 2.8755 3.0549 0.8942 0.0323 2.8069 2.0754 2.7987 1.3679 10.5478 4.3824 4.8749 101.5464 27.4445 10.7616 14.0644 24.0448 18.2081 24.8807 11.2762 8.8815 2.9994 2.3125 0.6939 52.8754 20.8854 5.8438 2.2237 20.4224 12.7477 0.5700 175.5630 23.7257 200.9595 0.1261 65.1515 1.9838 303.0734 23.4363 322.3754 14.2313 45.0663 22.0163 8.0601 13.1240 31.5992 14.0004 11.4110 21.1243 23.6311 131.3198 76.0421 56.4525 280.5697 3.6689 39.7414 13.3990 27.8439 15.2483 14.0178 13.9242 9.2886 6.0562 48.7927
temp: 298.150 k
press: 1.00000 atm
elementType: 8 8 8 8 6 6 6 6 6 6 6 6 6 6 1 1 1 1 1 1 1 1 1 1
symmnumber: 1
zpe: 470914.4 jmol-1
zpe.correction: 0.179362 hartree
zpe.thermalcorrener: 0.193321 hartree
zpe.thermalcorrenthalpy: 0.194265 hartree
zpe.thermalcorrgfe: 0.137379 hartree
zpe.sumelectzpe: -686.930342 hartree
zpe.sumelectthermal: -686.916383 hartree
zpe.sumelectthermalent: -686.915439 hartree
zpe.sumelectthermalfe: -686.972325 hartree
dipole: 1.9828 3.7411 -0.4283
dipole: 4.2557
quadrupole: -78.3048 -70.3600 -82.2093
quadrupole: 18.0981 1.2323 -0.8566
quadrupole: -1.3468 6.5980 -5.2513 18.0981 1.2323 -0.8566
hfenergy: -687.1097037 hartree
pointgroup: C01 [X(C10H10O4)]
dipole: 0.7361003 1.4960082 -0.1530433 debye
dipolederiv: -0.771906 0.8259242 -0.0302995 0.6817737 -0.7483968 0.0120135 -0.0277005 0.0200898 -0.3694136 -0.6868391 -0.2475969 0.0032276 -0.6161326 -1.3367005 -0.1266196 -0.0701087 -0.157339 -0.316212 -0.6458054 0.0483005 0.0001426 0.3857415 -1.0195449 0.0175557 -0.0067868 0.015362 -0.3146892 -0.9558013 0.1896527 0.1005764 -0.0715935 -0.5899837 -0.0610206 0.0438102 -0.0899139 -0.3268754 -0.8924723 0.2374078 -0.0066738 0.2030182 -0.4899594 0.0112453 -0.0035784 0.0103549 -0.0422124 -0.6029887 -0.191591 0.0109996 0.1224058 -0.4151276 -0.0033174 0.0085274 -0.0000113 -0.0423515 0.4427157 -0.004091 0.0058208 -0.0562227 -0.0228069 -0.0018523 -0.0271931 -0.0084773 -0.0484346 0.8615474 -0.7864899 0.0316203 -0.3763307 0.8012556 -0.0291686 0.0448593 -0.0228057 0.1039719 0.1415239 -0.1412484 0.0031403 -0.167084 0.3601503 -0.0093965 0.0065843 -0.0107297 -0.098993 -0.5768743 0.4218743 -0.0125097 -0.0275275 0.0393136 -0.0057993 -0.0062838 -0.0011804 -0.1966701 1.6101662 -0.3609233 0.0063922 -0.5748145 1.1438297 -0.0257292 0.0117384 -0.0185168 0.1201918 1.4994176 0.123354 -0.1213612 0.6458959 1.5691534 0.2040442 -0.0145942 0.2226644 0.2879471 -0.5382118 -0.0967395 0.0026676 -0.220467 -0.0639922 0.0026788 0.0021775 0.0016336 0.0560678 0.4965973 0.2846835 0.0212775 0.2433921 0.4785657 0.0064963 0.0219898 0.0109561 0.2806263 0.1845267 0.0217562 0.0017781 -0.038468 0.0734266 0.0038632 0.0114478 0.0026968 0.1453693 -0.0516337 -0.0768569 0.0003882 -0.078724 0.0893289 0.0010824 0.0014923 -0.000058 0.1384564 0.0575974 0.0343437 -0.0014516 0.0045414 -0.1304583 0.0067041 -0.00282 0.0083987 0.1706038 -0.0096847 0.0658332 -0.0003471 0.1438859 -0.0054572 0.0015053 -0.0014317 0.0017919 0.1218906 0.088641 -0.0013225 0.0215936 -0.0196981 0.0317108 -0.1094846 -0.012719 -0.0997402 -0.0222877 0.0894707 -0.0011212 -0.0223114 -0.018277 0.0374809 0.1083657 0.0131573 0.0984124 -0.0288422 0.2641159 -0.2335705 0.0049136 -0.1673259 0.2184603 0.0041301 0.0018517 0.0059858 0.377314 -0.0539532 -0.0689588 -0.0877063 0.0363247 0.036582 0.080035 -0.0893019 0.036334 -0.0182495 -0.0198415 -0.0967916 0.0531512 -0.0151303 0.0569044 -0.0478094 0.0901045 0.0172439 -0.0900347 0.0696922 0.0541716 0.0149709 -0.0191833 -0.1137346 -0.0395223 0.0047775 -0.0431518 0.1128267 unknown
polarizability: 174.2383631|-5.5252707|149.4817134|-0.41611|0.2143517|58.888737 unknown
InChI: InChI=1S/C10H10O4/c1-6(11)7-3-4-9(12)8(5-7)10(13)14-2/h3-5,12H,1-2H3
charge 0 multiplicity 1
24 atoms
O  -1.752582 2.556865 -0.106733
O  -2.113842 -1.689593 -0.231262
O  2.60805 -2.188455 0.009684
O  -3.281937 0.275747 0.204513
C  1.634576 0.013868 -0.037054
C  -0.827961 0.308244 -0.041259
C  0.320728 -0.515957 -0.030696
C  -0.638818 1.726897 -0.070113
C  1.796086 1.425711 -0.059764
C  0.67444 2.268587 -0.078214
C  2.796005 -0.936276 -0.018564
C  -2.191811 -0.302966 -0.00428
C  4.211997 -0.365253 -0.033988
C  -3.406731 -2.406792 -0.183909
H  0.198107 -1.602081 -0.014615
H  2.796172 1.870478 -0.064146
H  0.805829 3.358317 -0.100512
H  4.931592 -1.197541 -0.024809
H  4.39285 0.276388 0.848846
H  4.385114 0.251372 -0.935824
H  -1.479584 3.509848 -0.1359
H  -4.095585 -2.006554 -0.946987
H  -3.870638 -2.297424 0.811184
H  -3.151857 -3.45583 -0.389797
